{"text_format":"1","workbook":"xlsx","n_sheets":4,"sheets":["7.1 and 7.2","Graph Paper 10px","Graph Paper 15px","Graph Paper 20px"],"not_rendered":{"charts":1,"images":0,"macros":1,"external_links":0,"defined_names":14,"comments":0,"pivot_tables":0},"unopened":[],"bounds":{"document_bytes":16777216,"sheet_cells":100000,"rows_first":2000,"rows_last":500,"rows_between":2000,"halvings":0,"cell_chars":16384,"cell_head_chars":4096},"cells_cut":0,"cells_raw":0,"read":"whole","date_system":"1900"}

{"sheet":"7.1 and 7.2","index":0,"n_rows":52,"n_cols":67,"rows_kept":52,"cut":false,"hidden":false,"merged":[[24,2,24,6],[31,37,31,38],[25,1,27,1],[2,19,2,20],[2,22,2,23],[7,37,8,38],[19,37,19,38],[14,37,14,38],[10,37,10,38],[4,26,4,27],[1,4,1,6],[1,25,1,27],[49,1,51,1],[2,1,4,5],[36,37,36,38],[1,19,1,20],[1,22,1,23],[1,16,1,17],[1,13,1,14],[41,37,41,38],[37,1,39,1],[1,8,2,8],[2,13,2,14],[2,16,2,17],[12,2,12,6],[13,1,15,1]]}
[]
[null,"Section 7.1, 7.2 Template",null,null,"Fill Green Cells",null,null,null,"Objective Function","x","y",null,null,"Line 1",null,null,"Line 1",null,null,"Line 1 & 2",null,null,"Line 1 & 3",null,null,"Select a Point"]
[null,"This template is mainly to check your charts and corner point values. You still have to manually shade the solution region to decide the correct corner points.",null,null,null,null,null,null,null,null,null,null,null,"x-intercepts",null,null,"y-intercepts",null,null,"Intersection Point",null,null,"Intersection Point",null,null,"x",null,"y",null,null,null,null,null,null,null,null,null,null,null,null,{"$f":"IF(AND(J3=\"\",K3=\"\"),\"\",IF($N$2=\"Line 1\",$AU$4*$J$3,IF($N$2=\"Line 2\",$AY$4*$J$3,IF($N$2=\"Line 3\",$BC$4*$J$3,IF($N$2=\"Line 4\",$BG$4*$J$3,\"\")))))","v":""},{"$f":"IF(AND(J3=\"\",K3=\"\"),\"\",IF($Q$2=\"Line 1\",$AV$5*$K$3,IF($Q$2=\"Line 2\",$AZ$5*$K$3,IF($Q$2=\"Line 3\",$BD$5*$K$3,IF($Q$2=\"Line 4\",$BH$5*$K$3,\"\")))))","v":""},{"$f":"IF(AND(J3=\"\",K3=\"\"),\"\",IF(OR(BN29=\"\",BO29=\"\",,BN29=\"N.S.\"),\"\",$BN$29*$J$3+$BO$29*$K$3))","v":""},{"$f":"IF(AND(J3=\"\",K3=\"\"),\"\",IF(OR(BN32=\"\",BO32=\"\",BN32=\"N.S.\"),\"\",$BN$32*$J$3+$BO$32*$K$3))","v":""},null,{"$f":"IF(BL12=\"\",\"\",\"Line 1\")","v":""},{"$f":"IF(BL12=\"\",\"\",\"x\")","v":""},{"$f":"IF(BL12=\"\",\"\",\"y\")","v":""},{"$f":"AZ9","v":"None"},{"$f":"IF(BL13=\"\",\"\",\"Line 2\")","v":""},{"$f":"IF(BL13=\"\",\"\",\"x\")","v":""},{"$f":"IF(BL13=\"\",\"\",\"y\")","v":""},{"$f":"AZ21","v":"None"},{"$f":"IF(BL14=\"\",\"\",\"Line 3\")","v":""},{"$f":"IF(BL14=\"\",\"\",\"x\")","v":""},{"$f":"IF(BL14=\"\",\"\",\"y\")","v":""},{"$f":"AZ33","v":"None"},{"$f":"IF(BL15=\"\",\"\",\"Line 4\")","v":""},{"$f":"IF(BL15=\"\",\"\",\"x\")","v":""},{"$f":"IF(BL15=\"\",\"\",\"y\")","v":""},{"$f":"AZ41","v":"None"}]
[null,null,null,null,null,null,null,null,"F(x) =",{"$f":"IF(AND($J$3=0,$K$3=0),\"\",IF($J$3=\"\",\"0 x\",ROUND($J$3,2)&\" x\"))","v":""},{"$f":"IF(AND($J$3=0,$K$3=0),\"\",IF($K$3=\"\",\"+ 0 y\",IF($K$3<0,ROUND($K$3,2)&\" y\",\"+  \"&ROUND($K$3,2)&\" y\")))","v":""},null,null,{"$f":" \"x = \"&$BO$25","v":"x = "},{"$f":"\"y = 0\"","v":"y = 0"},null,{"$f":"\"x = 0\"","v":"x = 0"},{"$f":" \"y = \"&$BO$26","v":"y = "},null,{"$f":" \"x = \"&$BN$29","v":"x = "},{"$f":" \"y = \"&$BO$29","v":"y = "},null,{"$f":" \"x = \"&$BN$32","v":"x = "},{"$f":" \"y = \"&$BO$32","v":"y = "},null,null,null,null,null,null,null,null,null,null,null,null,null,null,null,{"$f":"IF(AND(Z4=\"\",AB4=\"\"),\"\",\"Selected\")","v":""},{"$f":"IF(Z4=\"\",0,Z4)","v":0},null,null,null,null,{"$f":"IF(AT3=\"\",\"\",\"x-intercept\")","v":""},{"$f":"IF(AZ9=\"H\",\"\",IF($C$9+$D$9+$F$9=0,\"\",IF($D$9=0,$F$9/$C$9,IF($D$9=\"\",\"\",IF($C$9=0,0,$F$9/$C$9)))))","v":""},{"$f":"IF(OR(AZ9=\"H\",$BL$12=\"\"),\"\",0)","v":""},null,{"$f":"IF(AX3=\"\",\"\",\"x-intercept\")","v":""},{"$f":"IF(AZ21=\"H\",\"\",IF($C$21+$D$21+$F$21=0,\"\",IF($D$21=0,$F$21/$C$21,IF($D$21=\"\",\"\",IF($C$21=0,0,$F$21/$C$21)))))","v":""},{"$f":"IF(OR(AZ21=\"H\",$BL$13=\"\"),\"\",0)","v":""},null,{"$f":"IF(BB3=\"\",\"\",\"x-intercept\")","v":""},{"$f":"IF(AZ33=\"H\",\"\",IF($C$33+$D$33+$F$33=0,\"\",IF($D$33=0,$F$33/$C$33,IF($D$33=\"\",\"\",IF($C$33=0,0,$F$33/$C$33)))))","v":""},{"$f":"IF(OR(AZ33=\"H\",$BL$14=\"\"),\"\",0)","v":""},null,{"$f":"IF(BF3=\"\",\"\",\"x-intercept\")","v":""},{"$f":"IF(AZ41=\"H\",\"\",IF($C$45+$D$45+$F$45=0,\"\",IF($D$45=0,$F$45/$C$45,IF($D$45=\"\",\"\",IF($C$45=0,0,$F$45/$C$45)))))","v":""},{"$f":"IF(OR(AZ41=\"H\",$BL$15=\"\"),\"\",0)","v":""}]
[null,null,null,null,null,null,null,null,null,null,null,null,null,{"$f":"IF(AND($J$3=\"\",$K$3=\"\"),\"\",\"F =\")","v":""},{"$f":"IFERROR(AO3,\"\")","v":""},null,{"$f":"IF(AND($J$3=\"\",$K$3=\"\"),\"\",\"F =\")","v":""},{"$f":"IFERROR(AP3,\"\")","v":""},null,{"$f":"IF(AND($J$3=\"\",$K$3=\"\"),\"\",\"F =\")","v":""},{"$f":"AQ3","v":""},null,{"$f":"IF(AND($J$3=\"\",$K$3=\"\"),\"\",\"F =\")","v":""},{"$f":"AR3","v":""},null,{"$f":"IF(OR(J3=\"\",K3=\"\"),\"\",IF(AND(Z4=\"\",AB4,\"\"),\"\",\"F(x) =\"))","v":""},{"$f":"IF(Z5=\"\",\"\",Z4*J3+AB4*K3)","v":""},null,null,null,null,null,null,null,null,null,null,null,null,null,{"$f":"IF(AB4=\"\",0,AB4)","v":0},null,null,null,null,{"$f":"IF(AT3=\"\",\"\",\"y-intercept\")","v":""},{"$f":"IF(OR($BL$12=\"\",AZ9=\"V\"),\"\",0)","v":""},{"$f":"IF(AZ9=\"V\",\"\",IF($C$9+$D$9+$F$9=0,\"\",IF($C$9=0,$F$9/$D$9,IF($D$9=0,0,IF($C$9=\"\",\"\",$F$9/$D$9)))))","v":""},null,{"$f":"IF(AX3=\"\",\"\",\"y-intercept\")","v":""},{"$f":"IF(OR($BL$13=\"\",AZ21=\"V\"),\"\",0)","v":""},{"$f":"IF(AZ21=\"V\",\"\",IF($C$21+$D$21+$F$21=0,\"\",IF($C$21=0,$F$21/$D$21,IF($D$21=0,0,IF($C$21=\"\",\"\",$F$21/$D$21)))))","v":""},null,{"$f":"IF(BB3=\"\",\"\",\"y-intercept\")","v":""},{"$f":"IF(OR($BL$14=\"\",AZ33=\"V\"),\"\",0)","v":""},{"$f":"IF(AZ33=\"V\",\"\",IF($C$33+$D$33+$F$33=0,\"\",IF($C$33=0,$F$33/$D$33,IF($D$33=0,0,IF($C$33=\"\",\"\",$F$33/$D$33)))))","v":""},null,{"$f":"IF(BF3=\"\",\"\",\"y-intercept\")","v":""},{"$f":"IF(OR($BL$15=\"\",AZ41=\"V\"),\"\",0)","v":""},{"$f":"IF(AZ41=\"V\",\"\",IF($C$45+$D$45+$F$45=0,\"\",IF($C$45=0,$F$45/$D$45,IF($D$45=0,0,IF($C$45=\"\",\"\",$F$45/$D$45)))))","v":""}]
[]
[null,null,null,null,null,null,null,null,null,null,null,null,null,null,null,null,null,null,null,null,null,null,null,null,null,null,null,null,null,null,null,null,null,null,null,null,null,null,null,null,null,null,null,null,null,null,null,null,null,null,null,null,"Slope"]
[null,"Line 1","x","y",null,null,null,null,null,null,null,null,null,null,null,null,null,null,null,null,null,null,null,null,null,null,null,null,null,null,null,null,null,null,null,null,null,"Intersection Points:",null,null,null,null,null,null,null,null,null,"x","x","x",null,null,null,null,null,"Line 1_Line 2","Line 2_Line 3","Line 1_Line 3"]
[null,null,null,null,"=",null,null,null,null,null,null,null,null,null,null,null,null,null,null,null,null,null,null,null,null,null,null,null,null,null,null,null,null,null,null,null,null,null,null,null,null,null,null,null,null,null,null,{"$f":"IF($AZ$9=\"H\",$AV$12*-2,IF($AZ$9=\"V\",$AV$12,IF($D$14=\"\",\"\",ROUND($D$14,2))))","v":-5},{"$f":"IF($AZ$9=\"H\",$AV$12*2,IF($AZ$9=\"V\",$AV$12,IF($D$15=\"\",\"\",ROUND($D$15,2))))","v":0},{"$f":"IF($AZ$9=\"H\",$AV$12*4,IF($AZ$9=\"V\",$AV$12,IF($D$16=\"\",\"\",ROUND($D$16,2))))","v":5},{"$f":"AL13","v":0},{"$f":"IF(AND(C9=0,D9=0,F9=0),\"None\",IF(E12=\"Vertical Line\",\"V\",IF(E12=\"Horizontal Line\",\"H\",\"R\")))","v":"None"},{"$f":"IF(AND(F9=0,D9=0),\"\",IF(AND(C9=0,D9=0,F9<>0),\"\",IF(AND(C9=0,D9=0,F9=0),\"\",IF(E12=\"\",(-1*C9)/D9,\"\"))))","v":""},null,null,{"$f":"MMULT(MINVERSE($BD$12:$BE$13), $BG$12:$BG$13)","v":{"$error":"#NUM!"}},{"$f":"MMULT(MINVERSE($BD$13:$BE$14), $BG$13:$BG$14)","v":{"$error":"#NUM!"}},{"$f":"MMULT(MINVERSE($BD$14:$BE$15), $BG$14:$BG$15)","v":{"$error":"#NUM!"}}]
[null,null,{"$f":"IF(C9+D9+F9=0,\"\",IF(OR(C9=0,C9=\"\"),\"0  x\",ROUND(C9,2)&\" x\"))","v":""},{"$f":"IF(C9+D9+F9=0,\"\",IF(OR(D9=0,D9=\"\"),\"+ 0 y\",IF(D9>0,\"+  \"&ROUND(D9,2)&\" y\",D9&\" y\")))","v":""},{"$f":"IF(E9=\"\",\"\",IF(C9+D9+F9=0,\"\",E9))","v":""},{"$f":"IF(C9+D9+F9=0,\"\",F9)","v":""},null,null,null,null,null,null,null,null,null,null,null,null,null,null,null,null,null,null,null,null,null,null,null,null,null,null,null,null,null,null,null,null,null,null,null,null,null,null,null,null,null,{"$f":"IF(AND(F9=0,D9=0),\"\",IF($AZ$9=\"H\",$AV$12,IF($AZ$9=\"v\",-2*$AV$12,IF($D$9=\"\",\"\",IF($D$9=0,$C$9,IF($D$14=\"\",\"\",($D$14*-$C$9+$F$9)/$D$9))))))","v":""},{"$f":"IF(AND(F9=0,D9=0),\"\",IF($AZ$9=\"H\",$AV$12,IF($AZ$9=\"v\",2*$AV$12,IF($D$9=\"\",\"\",IF($D$9=0,$C$9,IF($D$15=\"\",\"\",($D$15*-$C$9+$F$9)/$D$9))))))","v":""},{"$f":"IF(AND(F9=0,D9=0),\"\",IF($AZ$9=\"H\",$AV$12,IF($AZ$9=\"v\",4*$AV$12,IF($D$9=\"\",\"\",IF($D$9=0,$C$9,IF($D$16=\"\",\"\",($D$16*-$C$9+$F$9)/$D$9))))))","v":""},{"$f":"AM13","v":0}]
[null,null,null,null,null,null,null,null,null,null,null,null,null,null,null,null,null,null,null,null,null,null,null,null,null,null,null,null,null,null,null,null,null,null,null,null,null,{"$f":"IF(BL13=\"\",\"\",\"Line 1 and 2:\")","v":""},null,null,null,null,null,null,null,null,null,null,null,null,null,null,null,null,null,null,null,null,null,null,null,null,null,null,{"$f":"COUNTA(BL12:BL15)","v":4}]
[null,{"$f":"IF(AND(C9=0,D9=0,F9=0),\"\",IF(AND(C9=0,F9=0),\"\",IF(AND(C9=0,D9=0,F9<>0),\"\",IF(AND(D9=0,F9=0),\"\",IF(D9=0,\"Isolate x:\",\"Isolate y:\")))))","v":""},{"$f":"IF(AND(C9=0,D9=0,F9=0),\"\",IF(AND(C9=0,F9=0),\"\",IF(AND(D9=0,F9=0),\"\",IF(AND(C9=0,D9=0,F9<>0),\"\",IF(C9=0,\"y = \"&F9&\"/\"&D9&\" = \"&ROUND(F9/D9,2),IF(D9=0,\"x = \"&F9&\"/\"&C9&\" = \"&ROUND(F9/C9,2),IF(F9<0,\"y = (\"&-C9&\" x  \"&F10&\") / \"&D9,\"y = (\"&-C9&\" x + \"&F10&\") / \"&D9)))))))","v":""},null,{"$f":"IF(AND(C9=0,D9<>0,F9<>0),\"Horizontal Line\",IF(AND(C9<>0,D9=0,F9<>0),\"Vertical Line\",IF(AND(C9=0,D9=0,F9<>0),\"No Solution\",\"\")))","v":""},null,{"$f":"IF(AND(C9=0,D9=0,F9<>0),\"\",IF(BA9=\"\",\"\",IF(BA9>0,\"Rising Line\",IF(BA9<0,\"Falling Line\",\"\"))))","v":""},null,null,null,null,null,null,null,null,null,null,null,null,null,null,null,null,null,null,null,null,null,null,null,null,null,null,null,null,null,null,{"$f":"IF(BL13=\"\",\"\",IF(BD17=\"\",\"\",\"x\"))","v":""},{"$f":"IF(BL13=\"\",\"\",IF(BD18=\"\",\"\",\"y\"))","v":""},null,null,null,null,null,null,null,null,{"$f":"IF(AZ9=\"V\",F9/C9,IF(AZ9=\"H\",F9/D9,\"R\"))","v":"R"},null,null,null,null,null,null,1,{"$f":"$C$9","v":0},{"$f":"$D$9","v":0},null,{"$f":"$F$9","v":0},null,null,null,null,{"$f":"IF(AND(C9=0,D9=0,F9=0),\"\",\"Line 1\")","v":""}]
[null,null,null,null,null,null,null,null,null,null,null,null,null,null,null,null,null,null,null,null,null,null,null,null,null,null,null,null,null,null,null,null,null,null,null,null,null,{"$f":"IF(AL12=\"\",0,IF(BD17=\"\",0,BD17))","v":0},{"$f":"IF(AM12=\"\",0,IF(BD18=\"\",0,BD18))","v":0},null,null,null,null,null,null,null,null,null,null,null,null,null,null,null,2,{"$f":"$C$21","v":0},{"$f":"$D$21","v":0},null,{"$f":"$F$21","v":0},null,null,null,null,{"$f":"IF(AND(C21=0,D21=0,F21=0),\"\",\"Line 2\")","v":""},{"$f":"IF($BL$13=\"\",\"\",IF($BL$13<>\"\",\"Line 1 & 2\",\"\"))","v":""},{"$f":"AL13","v":0},{"$f":"AM13","v":0}]
[null,"Enter Values","x =",-5,null,"y =",{"$f":"IF(OR($E$12=\"No Solution\",$G$12=\"\"),\"\",AV10)","v":""},{"$f":"IF(OR($E$12=\"No Solution\",$E$12=\"Vertical Line\",$E$12=\"Horizontal Line\",$AZ$9=\"None\"),\"\",IF(AND(D14=0,G14<>0,D14<>\"\"),\"Y Intercept\",IF(AND(D14<>0,G14=0),\"X Intercept\",\"\")))","v":""},null,null,null,null,null,null,null,null,null,null,null,null,null,null,null,null,null,null,null,null,null,null,null,null,null,null,null,null,null,null,null,null,null,null,null,null,null,null,null,null,null,null,null,null,null,null,3,{"$f":"$C$33","v":0},{"$f":"$D$33","v":0},null,{"$f":"$F$33","v":0},null,null,null,null,{"$f":"IF(AND(C33=0,D33=0,F33=0),\"\",\"Line 3\")","v":""},{"$f":"IF($BL$14=\"\",\"\",IF($BL$14<>\"\",\"Line 2 & 3\",\"\"))","v":""},{"$f":"AL17","v":0},{"$f":"AM17","v":0}]
[null,null,"x =",0,null,"y =",{"$f":"IF(OR($E$12=\"No Solution\",$G$12=\"\"),\"\",AW10)","v":""},"",null,null,null,null,null,null,null,null,null,null,null,null,null,null,null,null,null,null,null,null,null,null,null,null,null,null,null,null,null,{"$f":"IF(BL14=\"\",\"\",\"Line 2 and 3:\")","v":""},null,null,null,null,null,null,null,null,null,null,null,null,null,null,null,null,1,{"$f":"BD12","v":0},{"$f":"BE12","v":0},null,0,null,null,null,null,{"$f":"IF(AND(C45=0,D45=0,F45=0),\"\",\"Line 4\")","v":""},{"$f":"IF($BL$14=\"\",\"\",IF($BL$14<>\"\",\"Line 1 & 3\",\"\"))","v":""},{"$f":"AL22","v":0},{"$f":"AM22","v":0}]
[null,null,"x =",5,null,"y =",{"$f":"IF(OR($E$12=\"No Solution\",$G$12=\"\"),\"\",AX10)","v":""},{"$f":"IF(OR($E$12=\"No Solution\",$E$12=\"Vertical Line\",$E$12=\"Horizontal Line\",$AZ$9=\"None\"),\"\",IF(AND(D16=0,G16<>0,D16<>\"\"),\"Y Intercept\",IF(AND(D16<>0,G16=0),\"X Intercept\",\"\")))","v":""},null,null,null,null,null,null,null,null,null,null,null,null,null,null,null,null,null,null,null,null,null,null,null,null,null,null,null,null,null,{"$f":"IF(BL14=\"\",\"\",\"x\")","v":""},{"$f":"IF(BL14=\"\",\"\",\"y\")","v":""},null,null,null,null,null,null,null,null,null,null,null,null,null,null,null,null,null,null,null,null,null,null,null,null,null,{"$f":"IF($BL$15=\"\",\"\",IF($BL$15<>\"\",\"Line 1 & 4\",\"\"))","v":""},{"$f":"AL34","v":0},{"$f":"AM34","v":0}]
[null,null,null,null,null,null,null,null,null,null,null,null,null,null,null,null,null,null,null,null,null,null,null,null,null,null,null,null,null,null,null,null,null,null,null,null,null,{"$f":"IF(AL16=\"\",0,IF(BE17=\"\",\"\",BE17))","v":0},{"$f":"IF(AM16=\"\",0,IF(BE18=\"\",\"\",BE18))","v":0},null,null,null,null,null,null,null,null,null,null,null,null,null,null,null,null,{"$f":"IFERROR(BD9,\"N.S.\")","v":"N.S."},{"$f":"IFERROR(BE9,\"N.S.\")","v":"N.S."},{"$f":"IFERROR(BF9,\"N.S.\")","v":"N.S."},null,null,null,null,null,null,{"$f":"IF($BL$15=\"\",\"\",IF($BL$15<>\"\",\"Line 2 & 4\",\"\"))","v":""},{"$f":"AL39","v":0},{"$f":"AM39","v":0}]
[null,null,null,null,null,null,null,null,null,null,null,null,null,null,null,null,null,null,null,null,null,null,null,null,null,null,null,null,null,null,null,null,null,null,null,null,null,null,null,null,null,null,null,null,null,null,null,null,null,null,null,null,null,null,null,{"$f":"IF(BD17=\"N.S.\",\"N.S.\",ROUND(BD10,2))","v":"N.S."},{"$f":"IF(BE17=\"N.S.\",\"N.S.\",ROUND(BE10,2))","v":"N.S."},{"$f":"IF(BF17=\"N.S.\",\"N.S.\",ROUND(BF10,2))","v":"N.S."},null,null,null,null,null,null,{"$f":"IF($BL$15=\"\",\"\",IF($BL$15<>\"\",\"Line 3 & 4\",\"\"))","v":""},{"$f":"AL44","v":0},{"$f":"AM44","v":0}]
[]
[null,"Line 2","x","y",null,null,null,null,null,null,null,null,null,null,null,null,null,null,null,null,null,null,null,null,null,null,null,null,null,null,null,null,null,null,null,null,null,{"$f":"IF(BL14=\"\",\"\",\"Line 1 and 3:\")","v":""},null,null,null,null,null,null,null,null,null,"Line 2",null,null,null,null,"Slope",null,null,null,null,null,null,null,null,null,null,null,"Line 1",{"$f":"$AU$4","v":""},{"$f":"$AV$5","v":""}]
[null,null,null,null,"=",null,null,null,null,null,null,null,null,null,null,null,null,null,null,null,null,null,null,null,null,null,null,null,null,null,null,null,null,null,null,null,null,{"$f":"IF(BL14=\"\",\"\",\"x\")","v":""},{"$f":"IF(BL14=\"\",\"\",\"y\")","v":""},null,null,null,null,null,null,null,null,{"$f":"IF($AZ$21=\"H\",$AV$24*-2,IF($AZ$21=\"V\",$AV$24,IF($D$26=\"\",\"\",ROUND($D$26,2))))","v":-5},{"$f":"IF($AZ$21=\"H\",$AV$24*2,IF($AZ$21=\"V\",$AV$24,IF($D$27=\"\",\"\",ROUND($D$27,2))))","v":0},{"$f":"IF($AZ$21=\"H\",$AV$24*4,IF($AZ$21=\"V\",$AV$24,IF($D$28=\"\",\"\",ROUND($D$28,2))))","v":5},null,{"$f":"IF(AND(C21=0,D21=0,F21=0),\"None\",IF(E24=\"Vertical Line\",\"V\",IF(E24=\"Horizontal Line\",\"H\",\"R\")))","v":"None"},{"$f":"IF(AND(F21=0,D21=0),\"\",IF(AND(C21=0,D21=0,F21<>0),\"\",IF(AND(C21=0,D21=0,F21=0),\"\",IF(E24=\"\",(-1*C21)/D21,\"\"))))","v":""},null,null,"Line 1_Line 4","Line 2_Line 4","Line 3_Line 4",null,null,null,null,null,null,"Line 2",{"$f":"$AY$4","v":""},{"$f":"$AZ$5","v":""}]
[null,null,{"$f":"IF(C21+D21+F21=0,\"\",IF(OR(C21=0,C21=\"\"),\"0  x\",ROUND(C21,2)&\" x\"))","v":""},{"$f":"IF(C21+D21+F21=0,\"\",IF(OR(D21=0,D21=\"\"),\"+ 0 y\",IF(D21>0,\"+ \"&ROUND(D21,2)&\" y\",D21&\" y\")))","v":""},{"$f":"IF(E21=\"\",\"\",IF(C21+D21+F21=0,\"\",E21))","v":""},{"$f":"IF(C21+D21+F21=0,\"\",F21)","v":""},null,null,null,null,null,null,null,null,null,null,null,null,null,null,null,null,null,null,null,null,null,null,null,null,null,null,null,null,null,null,null,{"$f":"IF(AL21=\"\",0,IF(BF17=\"\",\"\",BF17))","v":0},{"$f":"IF(AM21=\"\",0,IF(BF18=\"\",\"\",BF18))","v":0},null,null,null,null,null,null,null,null,{"$f":"IF(AND(F21=0,D21=0),\"\",IF($AZ$21=\"H\",$AV$24,IF($AZ$21=\"v\",-2*$AV$24,IF($D$21=\"\",\"\",IF($D$21=0,$C$21,IF($D$26=\"\",\"\",($D$26*-$C$21+$F$21)/$D$21))))))","v":""},{"$f":"IF(AND(F21=0,D21=0),\"\",IF($AZ$21=\"H\",$AV$24,IF($AZ$21=\"v\",2*$AV$24,IF($D$21=\"\",\"\",IF($D$21=0,$C$21,IF($D$27=\"\",\"\",($D$27*-$C$21+$F$21)/$D$21))))))","v":""},{"$f":"IF(AND(F21=0,D21=0),\"\",IF($AZ$21=\"H\",$AV$24,IF($AZ$21=\"v\",4*$AV$24,IF($D$21=\"\",\"\",IF($D$21=0,$C$21,IF($D$28=\"\",\"\",($D$28*-$C$21+$F$21)/$D$21))))))","v":""},null,null,null,null,null,{"$f":"MMULT(MINVERSE($BD$25:$BE$26), $BG$25:$BG$26)","v":{"$error":"#NUM!"}},{"$f":"MMULT(MINVERSE($BD$31:$BE$32), $BG$31:$BG$32)","v":{"$error":"#NUM!"}},{"$f":"MMULT(MINVERSE($BD$38:$BE$39), $BG$38:$BG$39)","v":{"$error":"#NUM!"}},null,null,null,null,null,null,"Line 3",{"$f":"$BC$4","v":""},{"$f":"$BD$5","v":""}]
[null,null,null,null,null,null,null,null,null,null,null,null,null,null,null,null,null,null,null,null,null,null,null,null,null,null,null,null,null,null,null,null,null,null,null,null,null,null,null,null,null,null,null,null,null,null,null,null,null,null,null,null,null,null,null,null,null,null,null,null,null,null,null,null,"Line 4",{"$f":"$BG$4","v":""},{"$f":"$BH$5","v":""}]
[null,{"$f":"IF(AND(C21=0,D21=0,F21=0),\"\",IF(AND(C21=0,F21=0),\"\",IF(AND(C21=0,D21=0,F21<>0),\"\",IF(AND(D21=0,F21=0),\"\",IF(D21=0,\"Isolate x:\",\"Isolate y:\")))))","v":""},{"$f":"IF(AND(C21=0,D21=0,F21=0),\"\",IF(AND(C21=0,F21=0),\"\",IF(AND(D21=0,F21=0),\"\",IF(AND(C21=0,D21=0,F21<>0),\"\",IF(C21=0,\"y = \"&F21&\"/\"&D21&\" = \"&ROUND(F21/D21,2),IF(D21=0,\"x = \"&F21&\"/\"&C21&\" = \"&ROUND(F21/C21,2),IF(F21<0,\"y = (\"&-C21&\" x  \"&F22&\") / \"&D21,\"y = (\"&-C21&\" x + \"&F22&\") / \"&D21)))))))","v":""},null,{"$f":"IF(AND(C21=0,D21<>0,F21<>0),\"Horizontal Line\",IF(AND(C21<>0,D21=0,F21<>0),\"Vertical Line\",IF(AND(C21=0,D21=0,F21<>0),\"No Solution\",\"\")))","v":""},null,{"$f":"IF(AND(C21=0,D21=0,F21<>0),\"\",IF(BA21=\"\",\"\",IF(BA21>0,\"Rising Line\",IF(BA21<0,\"Falling Line\",\"\"))))","v":""},null,null,null,null,null,null,null,null,null,null,null,null,null,null,null,null,null,null,null,null,null,null,null,null,null,null,null,null,null,null,null,null,null,null,null,null,null,null,null,null,{"$f":"IF(AZ21=\"V\",F21/C21,IF(AZ21=\"H\",F21/D21,\"R\"))","v":"R"}]
[null,null,null,null,null,null,null,null,null,null,null,null,null,null,null,null,null,null,null,null,null,null,null,null,null,null,null,null,null,null,null,null,null,null,null,null,null,null,null,null,null,null,null,null,null,null,null,null,null,null,null,null,null,null,1,{"$f":"$C$9","v":0},{"$f":"$D$9","v":0},null,{"$f":"$F$9","v":0},null,null,null,null,null,{"$f":"N2","v":"Line 1"},{"$f":"IFERROR(VLOOKUP(BM25,BM20:BO23,2,FALSE),\"\")","v":""},{"$f":"IF(BN25=\"\",\"\",ROUND(BN25,2))","v":""}]
[null,"Enter Values","x =",-5,null,"y =",{"$f":"IF(OR($E$24=\"No Solution\",$G$24=\"\"),\"\",AV22)","v":""},{"$f":"IF(OR($E$24=\"No Solution\",$E$24=\"Vertical Line\",$E$24=\"Horizontal Line\",$AZ$21=\"None\"),\"\",IF(AND(D26=0,G26<>0,D26<>\"\"),\"Y Intercept\",IF(AND(D26<>0,G26=0),\"X Intercept\",\"\")))","v":""},null,null,null,null,null,null,null,null,null,null,null,null,null,null,null,null,null,null,null,null,null,null,null,null,null,null,null,null,null,null,null,null,null,null,null,null,null,null,null,null,null,null,null,null,null,null,4,{"$f":"$C$45","v":0},{"$f":"$D$45","v":0},null,{"$f":"$F$45","v":0},null,null,null,null,null,{"$f":"Q2","v":"Line 1"},{"$f":"IFERROR(VLOOKUP(BM26,BM20:BO23,3,FALSE),\"\")","v":""},{"$f":"IF(BN26=\"\",\"\",ROUND(BN26,2))","v":""}]
[null,null,"x =",0,null,"y =",{"$f":"IF(OR($E$24=\"No Solution\",$G$24=\"\"),\"\",AW22)","v":""},{"$f":"IF(OR($E$24=\"No Solution\",$E$24=\"Vertical Line\",$E$24=\"Horizontal Line\",$AZ$21=\"None\"),\"\",IF(AND(D27=0,G27<>0,D27<>\"\"),\"Y Intercept\",IF(AND(D27<>0,G27=0),\"X Intercept\",\"\")))","v":""}]
[null,null,"x =",5,null,"y =",{"$f":"IF(OR($E$24=\"No Solution\",$G$24=\"\"),\"\",AX22)","v":""},{"$f":"IF(OR($E$24=\"No Solution\",$E$24=\"Vertical Line\",$E$24=\"Horizontal Line\",$AZ$21=\"None\"),\"\",IF(AND(D28=0,G28<>0,D28<>\"\"),\"Y Intercept\",IF(AND(D28<>0,G28=0),\"X Intercept\",\"\")))","v":""},null,null,null,null,null,null,null,null,null,null,null,null,null,null,null,null,null,null,null,null,null,null,null,null,null,null,null,null,null,null,null,null,null,null,null,null,null,null,null,null,null,null,null,null,null,null,null,{"$f":"IFERROR(BD22,\"N.S.\")","v":"N.S."},{"$f":"IFERROR(BE22,\"N.S.\")","v":"N.S."},{"$f":"IFERROR(BF22,\"N.S.\")","v":"N.S."},null,null,null,null,null,null,{"$f":"T2","v":"Line 1 & 2"},{"$f":"IFERROR(VLOOKUP(BM28,BM13:BO18,2,FALSE),\"\")","v":""},{"$f":"IFERROR(VLOOKUP(BM28,BM13:BO18,3,FALSE),\"\")","v":""}]
[null,null,null,null,null,null,null,null,null,null,null,null,null,null,null,null,null,null,null,null,null,null,null,null,null,null,null,null,null,null,null,null,null,null,null,null,null,null,null,null,null,null,null,null,null,null,null,null,null,null,null,null,null,null,null,{"$f":"IF(BD28=\"N.S.\",\"N.S.\",BD23)","v":"N.S."},{"$f":"IF(BE28=\"N.S.\",\"N.S.\",BE23)","v":"N.S."},{"$f":"IF(BF28=\"N.S.\",\"N.S.\",BF23)","v":"N.S."},null,null,null,null,null,null,null,{"$f":"IF(BN28=\"N.S.\",\"N.S.\",IF(BN28=\"\",\"\",ROUND(BN28,2)))","v":""},{"$f":"IF(BO28=\"N.S.\",\"N.S.\",IF(BO28=\"\",\"\",ROUND(BO28,2)))","v":""}]
[]
[null,null,null,null,null,null,null,null,null,null,null,null,null,null,null,null,null,null,null,null,null,null,null,null,null,null,null,null,null,null,null,null,null,null,null,null,null,null,null,null,null,null,null,null,null,null,null,null,null,null,null,null,null,null,2,{"$f":"$C$21","v":0},{"$f":"$D$21","v":0},null,{"$f":"$F$21","v":0},null,null,null,null,null,{"$f":"W2","v":"Line 1 & 3"},{"$f":"IFERROR(VLOOKUP(BM31,BM13:BO18,2,FALSE),\"\")","v":""},{"$f":"IFERROR(VLOOKUP(BM31,BM13:BO18,3,FALSE),\"\")","v":""}]
[null,"Line 3","x","y",null,null,null,null,null,null,null,null,null,null,null,null,null,null,null,null,null,null,null,null,null,null,null,null,null,null,null,null,null,null,null,null,null,{"$f":"IF(BL15=\"\",\"\",\"Line 1 and 4:\")","v":""},null,null,null,null,null,null,null,null,null,"Line 3",null,null,null,null,"Slope",null,4,{"$f":"$C$45","v":0},{"$f":"$D$45","v":0},null,{"$f":"$F$45","v":0},null,null,null,null,null,null,{"$f":"IF(BN31=\"N.S.\",\"N.S.\",IF(BN31=\"\",\"\",ROUND(BN31,2)))","v":""},{"$f":"IF(BO31=\"N.S.\",\"N.S.\",IF(BO31=\"\",\"\",ROUND(BO31,2)))","v":""}]
[null,null,null,null,"=",null,null,null,null,null,null,null,null,null,null,null,null,null,null,null,null,null,null,null,null,null,null,null,null,null,null,null,null,null,null,null,null,{"$f":"IF(BL15=\"\",\"\",\"x\")","v":""},{"$f":"IF(BL15=\"\",\"\",\"y\")","v":""},null,null,null,null,null,null,null,null,{"$f":"IF($AZ$33=\"H\",$AV$36*-2,IF($AZ$33=\"V\",$AV$36,IF($D$38=\"\",\"\",ROUND($D$38,2))))","v":-5},{"$f":"IF($AZ$33=\"H\",$AV$36*2,IF($AZ$33=\"V\",$AV$36,IF($D$39=\"\",\"\",ROUND($D$39,2))))","v":0},{"$f":"IF($AZ$33=\"H\",$AV$36*4,IF($AZ$33=\"V\",$AV$36,IF($D$40=\"\",\"\",ROUND($D$40,2))))","v":5},null,{"$f":"IF(AND(C33=0,D33=0,F33=0),\"None\",IF(E36=\"Vertical Line\",\"V\",IF(E36=\"Horizontal Line\",\"H\",\"R\")))","v":"None"},{"$f":"IF(AND(F33=0,D33=0),\"\",IF(AND(C33=0,D33=0,F33<>0),\"\",IF(AND(C33=0,D33=0,F33=0),\"\",IF(E36=\"\",(-1*C33)/D33,\"\"))))","v":""}]
[null,null,{"$f":"IF(C33+D33+F33=0,\"\",IF(OR(C33=0,C33=\"\"),\"0  x\",ROUND(C33,2)&\" x\"))","v":""},{"$f":"IF(C33+D33+F33=0,\"\",IF(OR(D33=0,D33=\"\"),\"+ 0 y\",IF(D33>0,\"+ \"&ROUND(D33,2)&\" y\",D33&\" y\")))","v":""},{"$f":"IF(E33=\"\",\"\",IF(C33+D33+F33=0,\"\",E33))","v":""},{"$f":"IF(C33+D33+F33=0,\"\",F33)","v":""},null,null,null,null,null,null,null,null,null,null,null,null,null,null,null,null,null,null,null,null,null,null,null,null,null,null,null,null,null,null,null,{"$f":"IF(AL33=\"\",0,IF(BD28=\"\",\"\",BD28))","v":0},{"$f":"IF(AM33=\"\",0,IF(BD29=\"\",\"\",BD29))","v":0},null,null,null,null,null,null,null,null,{"$f":"IF(AND(F33=0,D33=0),\"\",IF(AND(F33=0,D33=0),\"\",IF($AZ$33=\"H\",$AV$36,IF($AZ$33=\"v\",-2*$AV$36,IF($D$33=\"\",\"\",IF($D$33=0,$C$33,IF($D$38=\"\",\"\",($D$38*-$C$33+$F$33)/$D$33)))))))","v":""},{"$f":"IF(AND(F33=0,D33=0),\"\",IF(AND(F33=0,D33=0),\"\",IF($AZ$33=\"H\",$AV$36,IF($AZ$33=\"v\",2*$AV$36,IF($D$33=\"\",\"\",IF($D$33=0,$C$33,IF($D$39=\"\",\"\",($D$39*-$C$33+$F$33)/$D$33)))))))","v":""},{"$f":"IF(AND(F33=0,D33=0),\"\",IF(AND(F33=0,D33=0),\"\",IF($AZ$33=\"H\",$AV$36,IF($AZ$33=\"v\",4*$AV$36,IF($D$33=\"\",\"\",IF($D$33=0,$C$33,IF($D$40=\"\",\"\",($D$40*-$C$33+$F$33)/$D$33)))))))","v":""}]
[]
[null,{"$f":"IF(AND(C33=0,D33=0,F33=0),\"\",IF(AND(C33=0,F33=0),\"\",IF(AND(C33=0,D33=0,F33<>0),\"\",IF(AND(D33=0,F33=0),\"\",IF(D33=0,\"Isolate x:\",\"Isolate y:\")))))","v":""},{"$f":"IF(AND(C33=0,D33=0,F33=0),\"\",IF(AND(C33=0,F33=0),\"\",IF(AND(D33=0,F33=0),\"\",IF(AND(C33=0,D33=0,F33<>0),\"\",IF(C33=0,\"y = \"&F33&\"/\"&D33&\" = \"&ROUND(F33/D33,2),IF(D33=0,\"x = \"&F33&\"/\"&C33&\" = \"&ROUND(F33/C33,2),IF(F33<0,\"y = (\"&-C33&\" x  \"&F34&\") / \"&D33,\"y = (\"&-C33&\" x + \"&F34&\") / \"&D33)))))))","v":""},null,{"$f":"IF(AND(C33=0,D33<>0,F33<>0),\"Horizontal Line\",IF(AND(C33<>0,D33=0,F33<>0),\"Vertical Line\",IF(AND(C33=0,D33=0,F33<>0),\"No Solution\",\"\")))","v":""},null,{"$f":"IF(AND(C33=0,D33=0,F33<>0),\"\",IF(BA33=\"\",\"\",IF(BA33>0,\"Rising Line\",IF(BA33<0,\"Falling Line\",\"\"))))","v":""},null,null,null,null,null,null,null,null,null,null,null,null,null,null,null,null,null,null,null,null,null,null,null,null,null,null,null,null,null,null,null,null,null,null,null,null,null,null,null,null,{"$f":"IF(AZ33=\"V\",F33/C33,IF(AZ33=\"H\",F33/D33,\"R\"))","v":"R"}]
[null,null,{"$f":"IF(AZ33=\"V\",\"x = \"&ROUND(AV36,2)&\" for all\",IF(AZ33=\"H\",\"y = \"&ROUND(AV36,2)&\" for all\",\"\"))","v":""},null,null,null,null,null,null,null,null,null,null,null,null,null,null,null,null,null,null,null,null,null,null,null,null,null,null,null,null,null,null,null,null,null,null,{"$f":"IF(BL15=\"\",\"\",\"Line 2 and 4:\")","v":""}]
[null,"Enter Values","x =",-5,null,"y =",{"$f":"IF(OR($E$36=\"No Solution\",$G$36=\"\"),\"\",AV34)","v":""},{"$f":"IF(OR($E$36=\"No Solution\",$E$36=\"Vertical Line\",$E$36=\"Horizontal Line\",$AZ$33=\"None\"),\"\",IF(AND(D38=0,G38<>0,D38<>\"\"),\"Y Intercept\",IF(AND(D38<>0,G38=0),\"X Intercept\",\"\")))","v":""},null,null,null,null,null,null,null,null,null,null,null,null,null,null,null,null,null,null,null,null,null,null,null,null,null,null,null,null,null,{"$f":"IF(BL15=\"\",\"\",\"x\")","v":""},{"$f":"IF(BL15=\"\",\"\",\"y\")","v":""},null,null,null,null,null,null,null,null,null,null,null,null,null,null,null,3,{"$f":"$C$33","v":0},{"$f":"$D$33","v":0},null,{"$f":"$F$33","v":0}]
[null,null,"x =",0,null,"y =",{"$f":"IF(OR($E$36=\"No Solution\",$G$36=\"\"),\"\",AW34)","v":""},{"$f":"IF(OR($E$36=\"No Solution\",$E$36=\"Vertical Line\",$E$36=\"Horizontal Line\",$AZ$33=\"None\"),\"\",IF(AND(D39=0,G39<>0,D39<>\"\"),\"Y Intercept\",IF(AND(D39<>0,G39=0),\"X Intercept\",\"\")))","v":""},null,null,null,null,null,null,null,null,null,null,null,null,null,null,null,null,null,null,null,null,null,null,null,null,null,null,null,null,null,{"$f":"IF(AL38=\"\",0,IF(BE28=\"\",\"\",BE28))","v":0},{"$f":"IF(AM38=\"\",0,IF(BE29=\"\",\"\",BE29))","v":0},null,null,null,null,null,null,null,null,null,null,null,null,null,null,null,4,{"$f":"$C$45","v":0},{"$f":"$D$45","v":0},null,{"$f":"$F$45","v":0}]
[null,null,"x =",5,null,"y =",{"$f":"IF(OR($E$36=\"No Solution\",$G$36=\"\"),\"\",AX34)","v":""},{"$f":"IF(OR($E$36=\"No Solution\",$E$36=\"Vertical Line\",$E$36=\"Horizontal Line\",$AZ$33=\"None\"),\"\",IF(AND(D40=0,G40<>0,D40<>\"\"),\"Y Intercept\",IF(AND(D40<>0,G40=0),\"X Intercept\",\"\")))","v":""},null,null,null,null,null,null,null,null,null,null,null,null,null,null,null,null,null,null,null,null,null,null,null,null,null,null,null,null,null,null,null,null,null,null,null,null,null,null,null,"Line 4",null,null,null,null,"Slope"]
[null,null,null,null,null,null,null,null,null,null,null,null,null,null,null,null,null,null,null,null,null,null,null,null,null,null,null,null,null,null,null,null,null,null,null,null,null,null,null,null,null,null,null,null,null,null,null,{"$f":"IF($AZ$41=\"H\",$AV$44*-2,IF($AZ$41=\"V\",$AV$44,IF($D$50=\"\",\"\",ROUND($D$50,2))))","v":0},{"$f":"IF($AZ$41=\"H\",$AV$44*-2,IF($AZ$41=\"V\",$AV$44,IF($D$51=\"\",\"\",ROUND($D$51,2))))","v":5},{"$f":"IF($AZ$41=\"H\",$AV$44*-2,IF($AZ$41=\"V\",$AV$44,IF($D$52=\"\",\"\",ROUND($D$52,2))))","v":-7},null,{"$f":"IF(AND(C45=0,D45=0,F45=0),\"None\",IF(E48=\"Vertical Line\",\"V\",IF(E48=\"Horizontal Line\",\"H\",\"R\")))","v":"None"},{"$f":"IF(AND(F45=0,D45=0),\"\",IF(AND(C45=0,D45=0,F45<>0),\"\",IF(AND(C45=0,D45=0,F45=0),\"\",IF(E48=\"\",(-1*C45)/D45,\"\"))))","v":""},null,null,{"$f":"IFERROR(BD38,\"\")","v":0},{"$f":"IFERROR(BE38,\"\")","v":0},0,0]
[null,null,null,null,null,null,null,null,null,null,null,null,null,null,null,null,null,null,null,null,null,null,null,null,null,null,null,null,null,null,null,null,null,null,null,null,null,{"$f":"IF(BL15=\"\",\"\",\"Line 3 and 4:\")","v":""},null,null,null,null,null,null,null,null,null,{"$f":"IF(AND(F45=0,D50=0),\"\",IF(AND(F45=0,D50=0),\"\",IF($AZ$41=\"H\",$AV$44,IF($AZ$41=\"v\",-2*$AV$44,IF($D$45=\"\",\"\",IF($D$45=0,$C$45,IF($D$50=\"\",\"\",($D$50*-$C$45+$F$45)/$D$45)))))))","v":""},{"$f":"IF(AND(F45=0,D51=0),\"\",IF(AND(F45=0,D51=0),\"\",IF($AZ$41=\"H\",$AV$44,IF($AZ$41=\"v\",2*$AV$44,IF($D$45=\"\",\"\",IF($D$45=0,$C$45,IF($D$51=\"\",\"\",($D$51*-$C$45+$F$45)/$D$45)))))))","v":""},{"$f":"IF(AND(F45=0,D52=0),\"\",IF(AND(F45=0,D52=0),\"\",IF($AZ$41=\"H\",$AV$44,IF($AZ$41=\"v\",4*$AV$44,IF($D$45=\"\",\"\",IF($D$45=0,$C$45,IF($D$52=\"\",\"\",($D$52*-$C$45+$F$45)/$D$45)))))))","v":""},null,null,null,null,null,{"$f":"IFERROR(BD39,\"\")","v":0},{"$f":"IFERROR(BE39,\"\")","v":0},0,0]
[null,null,null,null,null,null,null,null,null,null,null,null,null,null,null,null,null,null,null,null,null,null,null,null,null,null,null,null,null,null,null,null,null,null,null,null,null,{"$f":"IF(BL15=\"\",\"\",\"x\")","v":""},{"$f":"IF(BL15=\"\",\"\",\"y\")","v":""}]
[null,"Line 4","x","y",null,null,null,null,null,null,null,null,null,null,null,null,null,null,null,null,null,null,null,null,null,null,null,null,null,null,null,null,null,null,null,null,null,{"$f":"IF(AL43=\"\",0,IF(BF28=\"\",\"\",BF28))","v":0},{"$f":"IF(AM43=\"\",0,IF(BF29=\"\",\"\",BF29))","v":0},null,null,null,null,null,null,null,null,{"$f":"IF(AZ41=\"V\",F45/C45,IF(AZ41=\"H\",F45/D45,\"R\"))","v":"R"}]
[null,null,null,null,"="]
[null,null,{"$f":"IF(C45+D45+F45=0,\"\",IF(OR(C45=0,C45=\"\"),\"0  x\",ROUND(C45,2)&\" x\"))","v":""},{"$f":"IF(C45+D45+F45=0,\"\",IF(OR(D45=0,D45=\"\"),\"+ 0 y\",IF(D45>0,\"+ \"&ROUND(D45,2)&\" y\",D45&\" y\")))","v":""},{"$f":"IF(E45=\"\",\"\",IF(C45+D45+F45=0,\"\",E45))","v":""},{"$f":"IF(C45+D45+F45=0,\"\",F45)","v":""}]
[]
[null,{"$f":"IF(AND(C45=0,D45=0,F45=0),\"\",IF(AND(C45=0,F45=0),\"\",IF(AND(C45=0,D45=0,F45<>0),\"\",IF(AND(D45=0,F45=0),\"\",IF(D45=0,\"Isolate x:\",\"Isolate y:\")))))","v":""},{"$f":"IF(AND(C45=0,D45=0,F45=0),\"\",IF(AND(C45=0,F45=0),\"\",IF(AND(D45=0,F45=0),\"\",IF(AND(C45=0,D45=0,F45<>0),\"\",IF(C45=0,\"y = \"&F45&\"/\"&D45&\" = \"&ROUND(F45/D45,2),IF(D45=0,\"x = \"&F45&\"/\"&C45&\" = \"&ROUND(F45/C45,2),IF(F45<0,\"y = (\"&-C45&\" x  \"&F46&\") / \"&D45,\"y = (\"&-C45&\" x + \"&F46&\") / \"&D45)))))))","v":""},null,{"$f":"IF(AND(C45=0,D45<>0,F45<>0),\"Horizontal Line\",IF(AND(C45<>0,D45=0,F45<>0),\"Vertical Line\",IF(AND(C45=0,D45=0,F45<>0),\"No Solution\",\"\")))","v":""},null,{"$f":"IF(AND(C45=0,D45=0,F45<>0),\"\",IF(BA41=\"\",\"\",IF(BA41>0,\"Rising Line\",IF(BA41<0,\"Falling Line\",\"\"))))","v":""}]
[null,null,{"$f":"IF(AZ41=\"V\",\"x = \"&ROUND(AV44,2)&\" for all\",IF(AZ41=\"H\",\"y = \"&ROUND(AV44,2)&\" for all\",\"\"))","v":""}]
[null,"Enter Values","x =",0,null,"y =",{"$f":"IF(OR($C$45=\"No Solution\",$D$45=\"\"),\"\",AV42)","v":""},{"$f":"IF(OR($E$48=\"No Solution\",$E$48=\"Vertical Line\",$E$48=\"Horizontal Line\",$AZ$21=\"None\"),\"\",IF(AND(D50=0,G50<>0,D50<>\"\"),\"Y Intercept\",IF(AND(D50<>0,G50=0),\"X Intercept\",\"\")))","v":""}]
[null,null,"x =",5,null,"y =",{"$f":"IF(OR($C$45=\"No Solution\",$D$45=\"\"),\"\",AW42)","v":""},{"$f":"IF(OR($E$48=\"No Solution\",$E$48=\"Vertical Line\",$E$48=\"Horizontal Line\",$AZ$21=\"None\"),\"\",IF(AND(D51=0,G51<>0,D51<>\"\"),\"Y Intercept\",IF(AND(D51<>0,G51=0),\"X Intercept\",\"\")))","v":""}]
[null,null,"x =",-7,null,"y =",{"$f":"IF(OR($C$45=\"No Solution\",$D$45=\"\"),\"\",AX42)","v":""},{"$f":"IF(OR($E$48=\"No Solution\",$E$48=\"Vertical Line\",$E$48=\"Horizontal Line\",$AZ$21=\"None\"),\"\",IF(AND(D52=0,G52<>0,D52<>\"\"),\"Y Intercept\",IF(AND(D52<>0,G52=0),\"X Intercept\",\"\")))","v":""}]

{"sheet":"Graph Paper 10px","index":1,"n_rows":95,"n_cols":57,"rows_kept":95,"cut":false,"hidden":false,"merged":[]}
[null,null,null,"Name:",null,null,null,null,null,null,null,null,null,null,null,null,null,null,null,null,null,null,null,null,null,null,null,null,null,null,null,null,null,null,null,null,null,null,null,null,null,null,null,null,null,null,null,null,null,null,null,null,null,null,null,null,"Date:"]
[]
[]
[]
[]
[]
[]
[]
[]
[]
[]
[]
[]
[]
[]
[]
[]
[]
[]
[]
[]
[]
[]
[]
[]
[]
[]
[]
[]
[]
[]
[]
[]
[]
[]
[]
[]
[]
[]
[]
[]
[]
[]
[]
[]
[]
[]
[]
[]
[]
[]
[]
[]
[]
[]
[]
[]
[]
[]
[]
[]
[]
[]
[]
[]
[]
[]
[]
[]
[]
[]
[]
[]
[]
[]
[]
[]
[]
[]
[]
[]
[]
[]
[]
[]
[]
[]
[]
[]
[]
[]
[]
[]
[]
[null,null,null,"Grid is not perfectly square"]

{"sheet":"Graph Paper 15px","index":2,"n_rows":63,"n_cols":37,"rows_kept":63,"cut":false,"hidden":false,"merged":[]}
[null,null,null,"Name:",null,null,null,null,null,null,null,null,null,null,null,null,null,null,null,null,null,null,null,null,null,null,null,null,null,null,null,null,null,null,null,null,"Date:"]
[]
[]
[]
[]
[]
[]
[]
[]
[]
[]
[]
[]
[]
[]
[]
[]
[]
[]
[]
[]
[]
[]
[]
[]
[]
[]
[]
[]
[]
[]
[]
[]
[]
[]
[]
[]
[]
[]
[]
[]
[]
[]
[]
[]
[]
[]
[]
[]
[]
[]
[]
[]
[]
[]
[]
[]
[]
[]
[]
[]
[]
[null,null,null,"Grid is not perfectly square"]

{"sheet":"Graph Paper 20px","index":3,"n_rows":48,"n_cols":28,"rows_kept":48,"cut":false,"hidden":false,"merged":[]}
[null,null,null,"Name:",null,null,null,null,null,null,null,null,null,null,null,null,null,null,null,null,null,null,null,null,null,null,null,"Date:"]
[]
[]
[]
[]
[]
[]
[]
[]
[]
[]
[]
[]
[]
[]
[]
[]
[]
[]
[]
[]
[]
[]
[]
[]
[]
[]
[]
[]
[]
[]
[]
[]
[]
[]
[]
[]
[]
[]
[]
[]
[]
[]
[]
[]
[]
[]
[null,null,null,"Grid is not perfectly square"]