{"text_format":"1","workbook":"xlsx","n_sheets":4,"sheets":["6.1","Graph Paper 10px","Graph Paper 15px","Graph Paper 20px"],"not_rendered":{"charts":1,"images":0,"macros":1,"external_links":0,"defined_names":15,"comments":0,"pivot_tables":0},"unopened":[],"bounds":{"document_bytes":16777216,"sheet_cells":100000,"rows_first":2000,"rows_last":500,"rows_between":2000,"halvings":0,"cell_chars":16384,"cell_head_chars":4096},"cells_cut":0,"cells_raw":0,"read":"whole","date_system":"1900"}

{"sheet":"6.1","index":0,"n_rows":44,"n_cols":65,"rows_kept":44,"cut":false,"hidden":false,"merged":[[1,8,1,12],[24,2,24,6],[25,1,27,1],[12,2,12,6],[13,1,15,1],[3,2,3,4],[2,8,2,9],[2,11,2,12],[31,35,31,36],[36,35,36,36],[41,35,41,36],[7,35,8,36],[10,35,10,36],[14,35,14,36],[19,35,19,36],[16,27,16,28],[17,27,17,28],[1,23,1,25],[2,14,2,15],[2,17,2,18],[2,20,2,21],[1,14,1,18],[1,20,1,21],[8,27,13,28],[14,27,15,29]]}
[]
[null,"Section 6.1 : Solving Graphically",null,null,null,null,null,null,{"$f":"IF(AND(C9=0,D9=0,F9=0),\"\",\"Line 1\")","v":""},null,null,null,null,null,{"$f":"IF(AND(C21=0,D21=0,F21=0),\"\",\"Line 2\")","v":""},null,null,null,null,null,{"$f":"IF(OR(I2=\"\",O2=\"\"),\"\",\"Line 1 & 2\")","v":""},null,null,"Select a Point"]
[null,null,null,null,null,null,null,null,{"$f":"IF(I2=\"\",\"\",\"x-intercept\")","v":""},null,null,{"$f":"IF(I2=\"\",\"\",\"y-intercept\")","v":""},null,null,{"$f":"IF(O2=\"\",\"\",\"x-intercept\")","v":""},null,null,{"$f":"IF(O2=\"\",\"\",\"y-intercept\")","v":""},null,null,{"$f":"IF(U2=\"\",\"\",\"Intersection Point\")","v":""},null,null,"x",null,"y",null,null,null,null,null,null,null,null,null,null,null,null,{"$f":"IF(AND(J3=\"\",K3=\"\"),\"\",IF($O$2=\"Line 1\",$AS$4*$J$3,IF($O$2=\"Line 2\",$AW$4*$J$3,IF($O$2=\"Line 3\",$BA$4*$J$3,IF($O$2=\"Line 4\",$BE$4*$J$3,\"\")))))","v":""},{"$f":"IF(AND(J3=\"\",K3=\"\"),\"\",IF($R$2=\"Line 1\",$AT$5*$K$3,IF($R$2=\"Line 2\",$AX$5*$K$3,IF($R$2=\"Line 3\",$BB$5*$K$3,IF($R$2=\"Line 4\",$BF$5*$K$3,\"\")))))","v":""},{"$f":"IF(AND(J3=\"\",K3=\"\"),\"\",IF(OR(BL29=\"\",BM29=\"\",,BL29=\"N.S.\"),\"\",$BL$29*$J$3+$BM$29*$K$3))","v":""},{"$f":"IF(AND(J3=\"\",K3=\"\"),\"\",IF(OR(BL32=\"\",BM32=\"\",BL32=\"N.S.\"),\"\",$BL$32*$J$3+$BM$32*$K$3))","v":""},null,{"$f":"IF(BJ12=\"\",\"\",\"Line 1\")","v":""},{"$f":"IF(BJ12=\"\",\"\",\"x\")","v":""},{"$f":"IF(BJ12=\"\",\"\",\"y\")","v":""},{"$f":"AX9","v":"None"},{"$f":"IF(BJ13=\"\",\"\",\"Line 2\")","v":""},{"$f":"IF(BJ13=\"\",\"\",\"x\")","v":""},{"$f":"IF(BJ13=\"\",\"\",\"y\")","v":""},{"$f":"AX16","v":"None"},{"$f":"IF(BJ14=\"\",\"\",\"Line 3\")","v":""},{"$f":"IF(BJ14=\"\",\"\",\"x\")","v":""},{"$f":"IF(BJ14=\"\",\"\",\"y\")","v":""},{"$f":"AX33","v":"None"},{"$f":"IF(BJ15=\"\",\"\",\"Line 4\")","v":""},{"$f":"IF(BJ15=\"\",\"\",\"x\")","v":""},{"$f":"IF(BJ15=\"\",\"\",\"y\")","v":""},{"$f":"AX41","v":"None"}]
[null,null,"Fill Green Cells",null,null,null,null,null,{"$f":"IF(I2=\"\",\"\",  \"x = \"&$BM$25)","v":""},{"$f":"IF(I2=\"\",\"\", \"y = 0\")","v":""},null,{"$f":"IF(I2=\"\",\"\", \"x = 0\")","v":""},{"$f":"IF(I2=\"\",\"\",  \"y = \"&$BM$26)","v":""},null,{"$f":"IF(O2=\"\",\"\", \"x = \"&$BM$30)","v":""},{"$f":"IF(O2=\"\",\"\", \"y = 0\")","v":""},null,{"$f":"IF(O2=\"\",\"\", \"x = 0\")","v":""},{"$f":"IF(O2=\"\",\"\",  \"y = \"&$BM$31)","v":""},null,{"$f":"IF(U2=\"\",\"\", \"x = \"&$BL$29)","v":""},{"$f":"IF(U2=\"\",\"\",  \"y = \"&$BM$29)","v":""},null,null,null,null,null,null,null,null,null,null,null,null,null,null,null,{"$f":"IF(AND(X4=\"\",Z4=\"\"),\"\",\"Selected\")","v":""},{"$f":"IF(X4=\"\",0,X4)","v":0},null,null,null,null,{"$f":"IF(AR3=\"\",\"\",\"x-intercept\")","v":""},{"$f":"IF(AX9=\"H\",\"\",IF($C$9+$D$9+$F$9=0,\"\",IF($D$9=0,$F$9/$C$9,IF($D$9=\"\",\"\",IF($C$9=0,0,$F$9/$C$9)))))","v":""},{"$f":"IF(OR(AX9=\"H\",$BJ$12=\"\"),\"\",0)","v":""},null,{"$f":"IF(AV3=\"\",\"\",\"x-intercept\")","v":""},{"$f":"IF(AX16=\"H\",\"\",IF($C$21+$D$21+$F$21=0,\"\",IF($D$21=0,$F$21/$C$21,IF($D$21=\"\",\"\",IF($C$21=0,0,$F$21/$C$21)))))","v":""},{"$f":"IF(OR(AX16=\"H\",$BJ$13=\"\"),\"\",0)","v":""},null,{"$f":"IF(AZ3=\"\",\"\",\"x-intercept\")","v":""},{"$f":"IF(AX33=\"H\",\"\",IF($C$33+$D$33+$F$33=0,\"\",IF($D$33=0,$F$33/$C$33,IF($D$33=\"\",\"\",IF($C$33=0,0,$F$33/$C$33)))))","v":""},{"$f":"IF(OR(AX33=\"H\",$BJ$14=\"\"),\"\",0)","v":""},null,{"$f":"IF(BD3=\"\",\"\",\"x-intercept\")","v":""},{"$f":"IF(AX41=\"H\",\"\",IF($C$45+$D$45+$F$45=0,\"\",IF($D$45=0,$F$45/$C$45,IF($D$45=\"\",\"\",IF($C$45=0,0,$F$45/$C$45)))))","v":""},{"$f":"IF(OR(AX41=\"H\",$BJ$15=\"\"),\"\",0)","v":""}]
[null,null,null,null,null,null,null,null,null,null,null,null,null,null,null,null,null,null,null,null,null,null,null,null,null,null,null,null,null,null,null,null,null,null,null,null,null,null,{"$f":"IF(Z4=\"\",0,Z4)","v":0},null,null,null,null,{"$f":"IF(AR3=\"\",\"\",\"y-intercept\")","v":""},{"$f":"IF(OR($BJ$12=\"\",AX9=\"V\"),\"\",0)","v":""},{"$f":"IF(AX9=\"V\",\"\",IF($C$9+$D$9+$F$9=0,\"\",IF($C$9=0,$F$9/$D$9,IF($D$9=0,0,IF($C$9=\"\",\"\",$F$9/$D$9)))))","v":""},null,{"$f":"IF(AV3=\"\",\"\",\"y-intercept\")","v":""},{"$f":"IF(OR($BJ$13=\"\",AX16=\"V\"),\"\",0)","v":""},{"$f":"IF(AX16=\"V\",\"\",IF($C$21+$D$21+$F$21=0,\"\",IF($C$21=0,$F$21/$D$21,IF($D$21=0,0,IF($C$21=\"\",\"\",$F$21/$D$21)))))","v":""},null,{"$f":"IF(AZ3=\"\",\"\",\"y-intercept\")","v":""},{"$f":"IF(OR($BJ$14=\"\",AX33=\"V\"),\"\",0)","v":""},{"$f":"IF(AX33=\"V\",\"\",IF($C$33+$D$33+$F$33=0,\"\",IF($C$33=0,$F$33/$D$33,IF($D$33=0,0,IF($C$33=\"\",\"\",$F$33/$D$33)))))","v":""},null,{"$f":"IF(BD3=\"\",\"\",\"y-intercept\")","v":""},{"$f":"IF(OR($BJ$15=\"\",AX41=\"V\"),\"\",0)","v":""},{"$f":"IF(AX41=\"V\",\"\",IF($C$45+$D$45+$F$45=0,\"\",IF($C$45=0,$F$45/$D$45,IF($D$45=0,0,IF($C$45=\"\",\"\",$F$45/$D$45)))))","v":""}]
[]
[null,null,null,null,null,null,null,null,null,null,null,null,null,null,null,null,null,null,null,null,null,null,null,null,null,null,null,null,null,null,null,null,null,null,null,null,null,null,null,null,null,null,null,null,null,null,null,null,null,null,"Slope"]
[null,"Line 1","x","y",null,null,null,null,null,null,null,null,null,null,null,null,null,null,null,null,null,null,null,null,null,null,null,{"$f":"IF(O2=\"\",\"\",\"Case\")","v":""},null,null,null,null,null,null,null,"Intersection Points:",null,null,null,null,null,null,null,null,null,"x","x","x",null,null,null,null,null,"Line 1_Line 2"]
[null,null,null,null,"=",null,null,null,null,null,null,null,null,null,null,null,null,null,null,null,null,null,null,null,null,null,null,{"$f":"IF(O2=\"\",\"\",IF(AK13=\"Dep\",\"Consistent, Dependent, Infinite Number of Solutions\",IF(AK13=\"N.S.\",\"Inconsistent, Independent, No solution\",\"Consistent, Independent, one solution\")))","v":""},null,null,null,null,null,null,null,null,null,null,null,null,null,null,null,null,null,{"$f":"IF(AND(F9=0,D9=0),0,IF($AX$9=\"H\",$AT$12*-2,IF($AX$9=\"V\",$AT$12,IF($D$14=\"\",\"\",ROUND($D$14,2)))))","v":0},{"$f":"IF(AND(F9=0,D9=0),0,IF($AX$9=\"H\",$AT$12*2,IF($AX$9=\"V\",$AT$12,IF($D$15=\"\",\"\",ROUND($D$15,2)))))","v":0},{"$f":"IF(AND(F9=0,D9=0),0,IF($AX$9=\"H\",$AT$12*4,IF($AX$9=\"V\",$AT$12,IF($D$16=\"\",\"\",ROUND($D$16,2)))))","v":0},{"$f":"AJ13","v":0},{"$f":"IF(AND(C9=0,D9=0,F9=0),\"None\",IF(E12=\"Vertical Line\",\"V\",IF(E12=\"Horizontal Line\",\"H\",\"R\")))","v":"None"},{"$f":"IF(AND(F9=0,D9=0),\"\",IF(AND(C9=0,D9=0,F9<>0),\"\",IF(AND(C9=0,D9=0,F9=0),\"\",IF(E12=\"\",(-1*C9)/D9,\"\"))))","v":""},null,null,{"$f":"MMULT(MINVERSE($BB$12:$BC$13), $BE$12:$BE$13)","v":{"$error":"#NUM!"}}]
[null,null,{"$f":"IF(C9+D9+F9=0,\"\",IF(OR(C9=0,C9=\"\"),\"0  x\",ROUND(C9,2)&\" x\"))","v":""},{"$f":"IF(C9+D9+F9=0,\"\",IF(OR(D9=0,D9=\"\"),\"+ 0 y\",IF(D9>0,\"+  \"&ROUND(D9,2)&\" y\",D9&\" y\")))","v":""},{"$f":"IF(E9=\"\",\"\",IF(C9+D9+F9=0,\"\",E9))","v":""},{"$f":"IF(C9+D9+F9=0,\"\",F9)","v":""},null,null,null,null,null,null,null,null,null,null,null,null,null,null,null,null,null,null,null,null,null,null,null,null,null,null,null,null,null,null,null,null,null,null,null,null,null,null,null,{"$f":"IF(AND(F9=0,D9=0),0,IF($AX$9=\"H\",$AT$12,IF($AX$9=\"v\",-2*$AT$12,IF($D$9=\"\",\"\",IF($D$9=0,$C$9,IF($D$14=\"\",\"\",($D$14*-$C$9+$F$9)/$D$9))))))","v":0},{"$f":"IF(AND(F9=0,D9=0),0,IF($AX$9=\"H\",$AT$12,IF($AX$9=\"v\",2*$AT$12,IF($D$9=\"\",\"\",IF($D$9=0,$C$9,IF($D$15=\"\",\"\",($D$15*-$C$9+$F$9)/$D$9))))))","v":0},{"$f":"IF(AND(F9=0,D9=0),0,IF($AX$9=\"H\",$AT$12,IF($AX$9=\"v\",4*$AT$12,IF($D$9=\"\",\"\",IF($D$9=0,$C$9,IF($D$16=\"\",\"\",($D$16*-$C$9+$F$9)/$D$9))))))","v":0},{"$f":"AK13","v":0}]
[null,null,null,null,null,null,null,null,null,null,null,null,null,null,null,null,null,null,null,null,null,null,null,null,null,null,null,null,null,null,null,null,null,null,null,{"$f":"IF(BJ13=\"\",\"\",\"Line 1 and 2:\")","v":""}]
[null,{"$f":"IF(AND(C9=0,D9=0,F9=0),\"\",IF(AND(C9=0,F9=0),\"\",IF(AND(C9=0,D9=0,F9<>0),\"\",IF(AND(D9=0,F9=0),\"\",IF(D9=0,\"Isolate x:\",\"Isolate y:\")))))","v":""},{"$f":"IF(AND(C9=0,D9=0,F9=0),\"\",IF(AND(C9=0,F9=0),\"\",IF(AND(D9=0,F9=0),\"\",IF(AND(C9=0,D9=0,F9<>0),\"\",IF(C9=0,\"y = \"&F9&\"/\"&D9&\" = \"&ROUND(F9/D9,2),IF(D9=0,\"x = \"&F9&\"/\"&C9&\" = \"&ROUND(F9/C9,2),IF(F9<0,\"y = (\"&-C9&\" x  \"&F10&\") / \"&D9,\"y = (\"&-C9&\" x + \"&F10&\") / \"&D9)))))))","v":""},null,{"$f":"IF(AND(C9=0,D9<>0,F9<>0),\"Horizontal Line\",IF(AND(C9<>0,D9=0,F9<>0),\"Vertical Line\",IF(AND(C9=0,D9=0,F9<>0),\"No Solution\",\"\")))","v":""},null,{"$f":"IF(AND(C9=0,D9=0,F9<>0),\"\",IF(AY9=\"\",\"\",IF(AY9>0,\"Rising Line\",IF(AY9<0,\"Falling Line\",\"\"))))","v":""},null,null,null,null,null,null,null,null,null,null,null,null,null,null,null,null,null,null,null,null,null,null,null,null,null,null,null,null,{"$f":"IF(BJ13=\"\",\"\",IF(BB17=\"\",\"\",\"x\"))","v":""},{"$f":"IF(BJ13=\"\",\"\",IF(BB18=\"\",\"\",\"y\"))","v":""},null,null,null,null,null,null,null,null,{"$f":"IF(AX9=\"V\",F9/C9,IF(AX9=\"H\",F9/D9,\"R\"))","v":"R"},null,null,null,null,null,null,1,{"$f":"$C$9","v":0},{"$f":"$D$9","v":0},null,{"$f":"$F$9","v":0},null,null,null,null,{"$f":"IF(AND(C9=0,D9=0,F9=0),\"\",\"Line 1\")","v":""}]
[null,null,null,null,null,null,null,null,null,null,null,null,null,null,null,null,null,null,null,null,null,null,null,null,null,null,null,null,null,null,null,null,null,null,null,{"$f":"IF(AJ12=\"\",0,IF(BB17=\"\",0,BB17))","v":0},{"$f":"IF(AK12=\"\",0,IF(BB18=\"\",0,BB18))","v":0},null,null,null,null,null,null,null,null,null,null,null,null,null,null,null,2,{"$f":"$C$21","v":0},{"$f":"$D$21","v":0},null,{"$f":"$F$21","v":0},null,null,null,null,{"$f":"IF(AND(C21=0,D21=0,F21=0),\"\",\"Line 2\")","v":""},{"$f":"IF($BJ$13=\"\",\"\",IF($BJ$13<>\"\",\"Line 1 & 2\",\"\"))","v":""},{"$f":"AJ13","v":0},{"$f":"AK13","v":0}]
[null,"Enter Values","x =",-5,null,"y =",{"$f":"IF(OR($E$12=\"No Solution\",$G$12=\"\"),\"\",AT10)","v":""},{"$f":"IF(OR($E$12=\"No Solution\",$E$12=\"Vertical Line\",$E$12=\"Horizontal Line\",$AX$9=\"None\"),\"\",IF(AND(D14=0,G14<>0,D14<>\"\"),\"Y Intercept\",IF(AND(D14<>0,G14=0),\"X Intercept\",\"\")))","v":""},null,null,null,null,null,null,null,null,null,null,null,null,null,null,null,null,null,null,null,null,null,null,null,null,null,null,null,null,null,null,null,null,null,null,null,null,null,null,null,null,null,null,null,null,3,null,null,null,null,null,null,null,null,{"$f":"IF(AND(C33=0,D33=0,F33=0),\"\",\"Line 3\")","v":""},{"$f":"IF($BJ$14=\"\",\"\",IF($BJ$14<>\"\",\"Line 2 & 3\",\"\"))","v":""},{"$f":"AJ17","v":""},{"$f":"AK17","v":""}]
[null,null,"x =",0,null,"y =",{"$f":"IF(OR($E$12=\"No Solution\",$G$12=\"\"),\"\",AU10)","v":""},{"$f":"IF(OR($E$12=\"No Solution\",$E$12=\"Vertical Line\",$E$12=\"Horizontal Line\",$AX$9=\"None\"),\"\",IF(AND(D15=0,G15<>0,D15<>\"\"),\"Y Intercept\",IF(AND(D15<>0,G15=0),\"X Intercept\",\"\")))","v":""},null,null,null,null,null,null,null,null,null,null,null,null,null,null,null,null,null,null,null,{"$f":"IF(O2=\"\",\"\",IF(AK13=\"Dep\",\"y depends on x\",\"\"))","v":""},null,null,null,null,null,null,null,{"$f":"IF(BJ14=\"\",\"\",\"Line 2 and 3:\")","v":""},null,null,null,null,null,null,null,null,null,"Line 2",null,null,null,null,"Slope",null,1,null,null,null,null,null,null,null,null,{"$f":"IF(AND(C45=0,D45=0,F45=0),\"\",\"Line 4\")","v":""},{"$f":"IF($BJ$14=\"\",\"\",IF($BJ$14<>\"\",\"Line 1 & 3\",\"\"))","v":""},{"$f":"AJ22","v":""},{"$f":"AK22","v":""}]
[null,null,"x =",5,null,"y =",{"$f":"IF(OR($E$12=\"No Solution\",$G$12=\"\"),\"\",AV10)","v":""},{"$f":"IF(OR($E$12=\"No Solution\",$E$12=\"Vertical Line\",$E$12=\"Horizontal Line\",$AX$9=\"None\"),\"\",IF(AND(D16=0,G16<>0,D16<>\"\"),\"Y Intercept\",IF(AND(D16<>0,G16=0),\"X Intercept\",\"\")))","v":""},null,null,null,null,null,null,null,null,null,null,null,null,null,null,null,null,null,null,null,null,null,null,null,null,null,null,null,{"$f":"IF(BJ14=\"\",\"\",\"x\")","v":""},{"$f":"IF(BJ14=\"\",\"\",\"y\")","v":""},null,null,null,null,null,null,null,null,{"$f":"IF(AND(F21=0,D21=0),0,IF($AX$16=\"H\",$AT$19*-2,IF($AX$16=\"V\",$AT$19,IF($D$26=\"\",\"\",ROUND($D$26,2)))))","v":0},{"$f":"IF(AND(F21=0,D21=0),0,IF($AX$16=\"H\",$AT$19*2,IF($AX$16=\"V\",$AT$19,IF($D$27=\"\",\"\",ROUND($D$27,2)))))","v":0},{"$f":"IF(AND(F21=0,D21=0),0,IF($AX$16=\"H\",$AT$19*4,IF($AX$16=\"V\",$AT$19,IF($D$28=\"\",\"\",ROUND($D$28,2)))))","v":0},null,{"$f":"IF(AND(C21=0,D21=0,F21=0),\"None\",IF(E24=\"Vertical Line\",\"V\",IF(E24=\"Horizontal Line\",\"H\",\"R\")))","v":"None"},{"$f":"IF(AND(F21=0,D21=0),\"\",IF(AND(C21=0,D21=0,F21<>0),\"\",IF(AND(C21=0,D21=0,F21=0),\"\",IF(E24=\"\",(-1*C21)/D21,\"\"))))","v":""},null,null,null,null,null,null,null,null,null,null,null,{"$f":"IF($BJ$15=\"\",\"\",IF($BJ$15<>\"\",\"Line 1 & 4\",\"\"))","v":""},{"$f":"AJ34","v":0},{"$f":"AK34","v":0}]
[null,null,null,null,null,null,null,null,null,null,null,null,null,null,null,null,null,null,null,null,null,null,null,null,null,null,null,{"$f":"IF(O2=\"\",\"\",IF(AK13=\"Dep\",C12,\"\"))","v":""},null,null,null,null,null,null,null,{"$f":"IF(AJ16=\"\",\"\",IF(BC17=\"\",\"\",BC17))","v":""},{"$f":"IF(AK16=\"\",\"\",IF(BC18=\"\",\"\",BC18))","v":""},null,null,null,null,null,null,null,null,{"$f":"IF(AND(F21=0,D21=0),0,IF($AX$16=\"H\",$AT$19,IF($AX$16=\"v\",-2*$AT$19,IF($D$21=\"\",\"\",IF($D$21=0,$C$21,IF($D$26=\"\",\"\",($D$26*-$C$21+$F$21)/$D$21))))))","v":0},{"$f":"IF(AND(F21=0,D21=0),0,IF($AX$16=\"H\",$AT$19,IF($AX$16=\"v\",2*$AT$19,IF($D$21=\"\",\"\",IF($D$21=0,$C$21,IF($D$27=\"\",\"\",($D$27*-$C$21+$F$21)/$D$21))))))","v":0},{"$f":"IF(AND(F21=0,D21=0),0,IF($AX$16=\"H\",$AT$19,IF($AX$16=\"v\",4*$AT$19,IF($D$21=\"\",\"\",IF($D$21=0,$C$21,IF($D$28=\"\",\"\",($D$28*-$C$21+$F$21)/$D$21))))))","v":0},null,null,null,null,null,{"$f":"IF(AND(O2<>\"\",G14=G26,G15=G27,G16=G28),\"Dep\",IFERROR(BB9,\"N.S.\"))","v":"N.S."},{"$f":"IFERROR(BC9,\"N.S.\")","v":0},{"$f":"IFERROR(BD9,\"N.S.\")","v":0},null,null,null,null,null,null,{"$f":"IF($BJ$15=\"\",\"\",IF($BJ$15<>\"\",\"Line 2 & 4\",\"\"))","v":""},{"$f":"AJ39","v":0},{"$f":"AK39","v":0}]
[null,null,null,null,null,null,null,null,null,null,null,null,null,null,null,null,null,null,null,null,null,null,null,null,null,null,null,{"$f":"IF(O2=\"\",\"\",IF(AK13=\"Dep\",\"x = any value\",\"\"))","v":""},null,null,null,null,null,null,null,null,null,null,null,null,null,null,null,null,null,null,null,null,null,null,null,null,null,{"$f":"IF(AND(O2<>\"\",G14=G26,G15=G27,G16=G28),\"Dep\",IF(BB17=\"N.S.\",\"N.S.\",ROUND(BB10,2)))","v":"N.S."},{"$f":"IF(BC17=\"N.S.\",\"N.S.\",ROUND(BC10,2))","v":0},{"$f":"IF(BD17=\"N.S.\",\"N.S.\",ROUND(BD10,2))","v":0},null,null,null,null,null,null,{"$f":"IF($BJ$15=\"\",\"\",IF($BJ$15<>\"\",\"Line 3 & 4\",\"\"))","v":""},{"$f":"AJ44","v":0},{"$f":"AK44","v":0}]
[null,null,null,null,null,null,null,null,null,null,null,null,null,null,null,null,null,null,null,null,null,null,null,null,null,null,null,null,null,null,null,null,null,null,null,null,null,null,null,null,null,null,null,null,null,{"$f":"IF(AX16=\"V\",F21/C21,IF(AX16=\"H\",F21/D21,\"R\"))","v":"R"}]
[null,"Line 2","x","y",null,null,null,null,null,null,null,null,null,null,null,null,null,null,null,null,null,null,null,null,null,null,null,null,null,null,null,null,null,null,null,{"$f":"IF(BJ14=\"\",\"\",\"Line 1 and 3:\")","v":""},null,null,null,null,null,null,null,null,null,null,null,null,null,null,null,null,null,null,null,null,null,null,null,null,null,null,"Line 1",{"$f":"$AS$4","v":""},{"$f":"$AT$5","v":""}]
[null,null,null,null,"=",null,null,null,null,null,null,null,null,null,null,null,null,null,null,null,null,null,null,null,null,null,null,null,null,null,null,null,null,null,null,{"$f":"IF(BJ14=\"\",\"\",\"x\")","v":""},{"$f":"IF(BJ14=\"\",\"\",\"y\")","v":""},null,null,null,null,null,null,null,null,null,null,null,null,null,null,null,null,"Line 1_Line 4","Line 2_Line 4","Line 3_Line 4",null,null,null,null,null,null,"Line 2",{"$f":"$AW$4","v":""},{"$f":"$AX$5","v":""}]
[null,null,{"$f":"IF(C21+D21+F21=0,\"\",IF(OR(C21=0,C21=\"\"),\"0  x\",ROUND(C21,2)&\" x\"))","v":""},{"$f":"IF(C21+D21+F21=0,\"\",IF(OR(D21=0,D21=\"\"),\"+ 0 y\",IF(D21>0,\"+ \"&ROUND(D21,2)&\" y\",D21&\" y\")))","v":""},{"$f":"IF(E21=\"\",\"\",IF(C21+D21+F21=0,\"\",E21))","v":""},{"$f":"IF(C21+D21+F21=0,\"\",F21)","v":""},null,null,null,null,null,null,null,null,null,null,null,null,null,null,null,null,null,null,null,null,null,null,null,null,null,null,null,null,null,{"$f":"IF(AJ21=\"\",\"\",IF(BD17=\"\",\"\",BD17))","v":""},{"$f":"IF(AK21=\"\",\"\",IF(BD18=\"\",\"\",BD18))","v":""},null,null,null,null,null,null,null,null,null,null,null,null,null,null,null,null,{"$f":"MMULT(MINVERSE($BB$25:$BC$26), $BE$25:$BE$26)","v":{"$error":"#NUM!"}},{"$f":"MMULT(MINVERSE($BB$31:$BC$32), $BE$31:$BE$32)","v":{"$error":"#NUM!"}},{"$f":"MMULT(MINVERSE($BB$38:$BC$39), $BE$38:$BE$39)","v":{"$error":"#NUM!"}},null,null,null,null,null,null,"Line 3",{"$f":"$BA$4","v":""},{"$f":"$BB$5","v":""}]
[null,null,null,null,null,null,null,null,null,null,null,null,null,null,null,null,null,null,null,null,null,null,null,null,null,null,null,null,null,null,null,null,null,null,null,null,null,null,null,null,null,null,null,null,null,null,null,null,null,null,null,null,null,null,null,null,null,null,null,null,null,null,"Line 4",{"$f":"$BE$4","v":""},{"$f":"$BF$5","v":""}]
[null,{"$f":"IF(AND(C21=0,D21=0,F21=0),\"\",IF(AND(C21=0,F21=0),\"\",IF(AND(C21=0,D21=0,F21<>0),\"\",IF(AND(D21=0,F21=0),\"\",IF(D21=0,\"Isolate x:\",\"Isolate y:\")))))","v":""},{"$f":"IF(AND(C21=0,D21=0,F21=0),\"\",IF(AND(C21=0,F21=0),\"\",IF(AND(D21=0,F21=0),\"\",IF(AND(C21=0,D21=0,F21<>0),\"\",IF(C21=0,\"y = \"&F21&\"/\"&D21&\" = \"&ROUND(F21/D21,2),IF(D21=0,\"x = \"&F21&\"/\"&C21&\" = \"&ROUND(F21/C21,2),IF(F21<0,\"y = (\"&-C21&\" x  \"&F22&\") / \"&D21,\"y = (\"&-C21&\" x + \"&F22&\") / \"&D21)))))))","v":""},null,{"$f":"IF(AND(C21=0,D21<>0,F21<>0),\"Horizontal Line\",IF(AND(C21<>0,D21=0,F21<>0),\"Vertical Line\",IF(AND(C21=0,D21=0,F21<>0),\"No Solution\",\"\")))","v":""},null,{"$f":"IF(AND(C21=0,D21=0,F21<>0),\"\",IF(AY16=\"\",\"\",IF(AY16>0,\"Rising Line\",IF(AY16<0,\"Falling Line\",\"\"))))","v":""}]
[null,null,null,null,null,null,null,null,null,null,null,null,null,null,null,null,null,null,null,null,null,null,null,null,null,null,null,null,null,null,null,null,null,null,null,null,null,null,null,null,null,null,null,null,null,null,null,null,null,null,null,null,1,{"$f":"$C$9","v":0},{"$f":"$D$9","v":0},null,{"$f":"$F$9","v":0},null,null,null,null,null,"Line 1",{"$f":"IFERROR(VLOOKUP(BK25,BK20:BM23,2,FALSE),\"\")","v":""},{"$f":"IF(BL25=\"\",\"\",ROUND(BL25,2))","v":""}]
[null,"Enter Values","x =",-5,null,"y =",{"$f":"IF(OR($E$24=\"No Solution\",$G$24=\"\"),\"\",AT17)","v":""},{"$f":"IF(OR($E$24=\"No Solution\",$E$24=\"Vertical Line\",$E$24=\"Horizontal Line\",$AX$16=\"None\"),\"\",IF(AND(D26=0,G26<>0,D26<>\"\"),\"Y Intercept\",IF(AND(D26<>0,G26=0),\"X Intercept\",\"\")))","v":""},null,null,null,null,null,null,null,null,null,null,null,null,null,null,null,null,null,null,null,null,null,null,null,null,null,null,null,null,null,null,null,null,null,null,null,null,null,null,null,null,null,null,null,null,4,{"$f":"$C$45","v":0},{"$f":"$D$45","v":0},null,{"$f":"$F$45","v":0},null,null,null,null,null,"Line 1",{"$f":"IFERROR(VLOOKUP(BK26,BK20:BM23,3,FALSE),\"\")","v":""},{"$f":"IF(BL26=\"\",\"\",ROUND(BL26,2))","v":""}]
[null,null,"x =",0,null,"y =",{"$f":"IF(OR($E$24=\"No Solution\",$G$24=\"\"),\"\",AU17)","v":""},{"$f":"IF(OR($E$24=\"No Solution\",$E$24=\"Vertical Line\",$E$24=\"Horizontal Line\",$AX$16=\"None\"),\"\",IF(AND(D27=0,G27<>0,D27<>\"\"),\"Y Intercept\",IF(AND(D27<>0,G27=0),\"X Intercept\",\"\")))","v":""}]
[null,null,"x =",5,null,"y =",{"$f":"IF(OR($E$24=\"No Solution\",$G$24=\"\"),\"\",AV17)","v":""},{"$f":"IF(OR($E$24=\"No Solution\",$E$24=\"Vertical Line\",$E$24=\"Horizontal Line\",$AX$16=\"None\"),\"\",IF(AND(D28=0,G28<>0,D28<>\"\"),\"Y Intercept\",IF(AND(D28<>0,G28=0),\"X Intercept\",\"\")))","v":""},null,null,null,null,null,null,null,null,null,null,null,null,null,null,null,null,null,null,null,null,null,null,null,null,null,null,null,null,null,null,null,null,null,null,null,null,null,null,null,null,null,null,null,null,null,{"$f":"IFERROR(BB22,\"N.S.\")","v":"N.S."},{"$f":"IFERROR(BC22,\"N.S.\")","v":"N.S."},{"$f":"IFERROR(BD22,\"N.S.\")","v":"N.S."},null,null,null,null,null,null,{"$f":"U2","v":""},{"$f":"IFERROR(VLOOKUP(BK28,BK12:BM17,2,FALSE),\"\")","v":0},{"$f":"IFERROR(VLOOKUP(BK28,BK13:BM18,3,FALSE),\"\")","v":0}]
[null,null,null,null,null,null,null,null,null,null,null,null,null,null,null,null,null,null,null,null,null,null,null,null,null,null,null,null,null,null,null,null,null,null,null,null,null,null,null,null,null,null,null,null,null,null,null,null,null,null,null,null,null,{"$f":"IF(BB28=\"N.S.\",\"N.S.\",BB23)","v":"N.S."},{"$f":"IF(BC28=\"N.S.\",\"N.S.\",BC23)","v":"N.S."},{"$f":"IF(BD28=\"N.S.\",\"N.S.\",BD23)","v":"N.S."},null,null,null,null,null,null,null,{"$f":"IF(BL28=\"Dep\",\"Dep\",IF(BL28=\"N.S.\",\"N.S.\",IF(BL28=\"\",\"\",ROUND(BL28,2))))","v":0},{"$f":"IF(BM28=\"Dep\",\"Dep\",IF(BM28=\"N.S.\",\"N.S.\",IF(BM28=\"\",\"\",ROUND(BM28,2))))","v":0}]
[null,null,null,null,null,null,null,null,null,null,null,null,null,null,null,null,null,null,null,null,null,null,null,null,null,null,null,null,null,null,null,null,null,null,null,null,null,null,null,null,null,null,null,null,null,null,null,null,null,null,null,null,null,null,null,null,null,null,null,null,null,null,"Line 2",{"$f":"IFERROR(VLOOKUP(BK30,BK20:BM23,2,FALSE),\"\")","v":""},{"$f":"IF(BL30=\"\",\"\",ROUND(BL30,2))","v":""}]
[null,null,null,null,null,null,null,null,null,null,null,null,null,null,null,null,null,null,null,null,null,null,null,null,null,null,null,null,null,null,null,null,null,null,null,null,null,null,null,null,null,null,null,null,null,null,null,null,null,null,null,null,2,{"$f":"$C$21","v":0},{"$f":"$D$21","v":0},null,{"$f":"$F$21","v":0},null,null,null,null,null,"Line 2",{"$f":"IFERROR(VLOOKUP(BK31,BK20:BM23,3,FALSE),\"\")","v":""},{"$f":"IF(BL31=\"\",\"\",ROUND(BL31,2))","v":""}]
[null,null,null,null,null,null,null,null,null,null,null,null,null,null,null,null,null,null,null,null,null,null,null,null,null,null,null,null,null,null,null,null,null,null,null,{"$f":"IF(BJ15=\"\",\"\",\"Line 1 and 4:\")","v":""},null,null,null,null,null,null,null,null,null,"Line 3",null,null,null,null,"Slope",null,4,{"$f":"$C$45","v":0},{"$f":"$D$45","v":0},null,{"$f":"$F$45","v":0},null,null,null,null,null,null,null,{"$f":"IF(BM31=\"N.S.\",\"N.S.\",IF(BM31=\"\",\"\",ROUND(BM31,2)))","v":""}]
[null,null,null,null,null,null,null,null,null,null,null,null,null,null,null,null,null,null,null,null,null,null,null,null,null,null,null,null,null,null,null,null,null,null,null,{"$f":"IF(BJ15=\"\",\"\",\"x\")","v":""},{"$f":"IF(BJ15=\"\",\"\",\"y\")","v":""},null,null,null,null,null,null,null,null,{"$f":"IF($AX$33=\"H\",$AT$36*-2,IF($AX$33=\"V\",$AT$36,IF($D$38=\"\",\"\",ROUND($D$38,2))))","v":""},{"$f":"IF($AX$33=\"H\",$AT$36*2,IF($AX$33=\"V\",$AT$36,IF($D$39=\"\",\"\",ROUND($D$39,2))))","v":""},{"$f":"IF($AX$33=\"H\",$AT$36*4,IF($AX$33=\"V\",$AT$36,IF($D$40=\"\",\"\",ROUND($D$40,2))))","v":""},null,{"$f":"IF(AND(C33=0,D33=0,F33=0),\"None\",IF(E36=\"Vertical Line\",\"V\",IF(E36=\"Horizontal Line\",\"H\",\"R\")))","v":"None"},{"$f":"IF(AND(F33=0,D33=0),\"\",IF(AND(C33=0,D33=0,F33<>0),\"\",IF(AND(C33=0,D33=0,F33=0),\"\",IF(E36=\"\",(-1*C33)/D33,\"\"))))","v":""}]
[null,null,null,null,null,null,null,null,null,null,null,null,null,null,null,null,null,null,null,null,null,null,null,null,null,null,null,null,null,null,null,null,null,null,null,{"$f":"IF(AJ33=\"\",0,IF(BB28=\"\",\"\",BB28))","v":0},{"$f":"IF(AK33=\"\",0,IF(BB29=\"\",\"\",BB29))","v":0},null,null,null,null,null,null,null,null,{"$f":"IF(AND(F33=0,D33=0),\"\",IF(AND(F33=0,D33=0),\"\",IF($AX$33=\"H\",$AT$36,IF($AX$33=\"v\",-2*$AT$36,IF($D$33=\"\",\"\",IF($D$33=0,$C$33,IF($D$38=\"\",\"\",($D$38*-$C$33+$F$33)/$D$33)))))))","v":""},{"$f":"IF(AND(F33=0,D33=0),\"\",IF(AND(F33=0,D33=0),\"\",IF($AX$33=\"H\",$AT$36,IF($AX$33=\"v\",2*$AT$36,IF($D$33=\"\",\"\",IF($D$33=0,$C$33,IF($D$39=\"\",\"\",($D$39*-$C$33+$F$33)/$D$33)))))))","v":""},{"$f":"IF(AND(F33=0,D33=0),\"\",IF(AND(F33=0,D33=0),\"\",IF($AX$33=\"H\",$AT$36,IF($AX$33=\"v\",4*$AT$36,IF($D$33=\"\",\"\",IF($D$33=0,$C$33,IF($D$40=\"\",\"\",($D$40*-$C$33+$F$33)/$D$33)))))))","v":""}]
[]
[null,null,null,null,null,null,null,null,null,null,null,null,null,null,null,null,null,null,null,null,null,null,null,null,null,null,null,null,null,null,null,null,null,null,null,null,null,null,null,null,null,null,null,null,null,{"$f":"IF(AX33=\"V\",F33/C33,IF(AX33=\"H\",F33/D33,\"R\"))","v":"R"}]
[null,null,null,null,null,null,null,null,null,null,null,null,null,null,null,null,null,null,null,null,null,null,null,null,null,null,null,null,null,null,null,null,null,null,null,{"$f":"IF(BJ15=\"\",\"\",\"Line 2 and 4:\")","v":""}]
[null,null,null,null,null,null,null,null,null,null,null,null,null,null,null,null,null,null,null,null,null,null,null,null,null,null,null,null,null,null,null,null,null,null,null,{"$f":"IF(BJ15=\"\",\"\",\"x\")","v":""},{"$f":"IF(BJ15=\"\",\"\",\"y\")","v":""},null,null,null,null,null,null,null,null,null,null,null,null,null,null,null,3,{"$f":"$C$33","v":0},{"$f":"$D$33","v":0},null,{"$f":"$F$33","v":0}]
[null,null,null,null,null,null,null,null,null,null,null,null,null,null,null,null,null,null,null,null,null,null,null,null,null,null,null,null,null,null,null,null,null,null,null,{"$f":"IF(AJ38=\"\",0,IF(BC28=\"\",\"\",BC28))","v":0},{"$f":"IF(AK38=\"\",0,IF(BC29=\"\",\"\",BC29))","v":0},null,null,null,null,null,null,null,null,null,null,null,null,null,null,null,4,{"$f":"$C$45","v":0},{"$f":"$D$45","v":0},null,{"$f":"$F$45","v":0}]
[null,null,null,null,null,null,null,null,null,null,null,null,null,null,null,null,null,null,null,null,null,null,null,null,null,null,null,null,null,null,null,null,null,null,null,null,null,null,null,null,null,null,null,null,null,"Line 4",null,null,null,null,"Slope"]
[null,null,null,null,null,null,null,null,null,null,null,null,null,null,null,null,null,null,null,null,null,null,null,null,null,null,null,null,null,null,null,null,null,null,null,null,null,null,null,null,null,null,null,null,null,{"$f":"IF($AX$41=\"H\",$AT$44*-2,IF($AX$41=\"V\",$AT$44,IF($D$50=\"\",\"\",ROUND($D$50,2))))","v":""},{"$f":"IF($AX$41=\"H\",$AT$44*-2,IF($AX$41=\"V\",$AT$44,IF($D$51=\"\",\"\",ROUND($D$51,2))))","v":""},{"$f":"IF($AX$41=\"H\",$AT$44*-2,IF($AX$41=\"V\",$AT$44,IF($D$52=\"\",\"\",ROUND($D$52,2))))","v":""},null,{"$f":"IF(AND(C45=0,D45=0,F45=0),\"None\",IF(E48=\"Vertical Line\",\"V\",IF(E48=\"Horizontal Line\",\"H\",\"R\")))","v":"None"},{"$f":"IF(AND(F45=0,D45=0),\"\",IF(AND(C45=0,D45=0,F45<>0),\"\",IF(AND(C45=0,D45=0,F45=0),\"\",IF(E48=\"\",(-1*C45)/D45,\"\"))))","v":""},null,null,{"$f":"IFERROR(BB38,\"\")","v":0},{"$f":"IFERROR(BC38,\"\")","v":0},0,0]
[null,null,null,null,null,null,null,null,null,null,null,null,null,null,null,null,null,null,null,null,null,null,null,null,null,null,null,null,null,null,null,null,null,null,null,{"$f":"IF(BJ15=\"\",\"\",\"Line 3 and 4:\")","v":""},null,null,null,null,null,null,null,null,null,{"$f":"IF(AND(F45=0,D50=0),\"\",IF(AND(F45=0,D50=0),\"\",IF($AX$41=\"H\",$AT$44,IF($AX$41=\"v\",-2*$AT$44,IF($D$45=\"\",\"\",IF($D$45=0,$C$45,IF($D$50=\"\",\"\",($D$50*-$C$45+$F$45)/$D$45)))))))","v":""},{"$f":"IF(AND(F45=0,D51=0),\"\",IF(AND(F45=0,D51=0),\"\",IF($AX$41=\"H\",$AT$44,IF($AX$41=\"v\",2*$AT$44,IF($D$45=\"\",\"\",IF($D$45=0,$C$45,IF($D$51=\"\",\"\",($D$51*-$C$45+$F$45)/$D$45)))))))","v":""},{"$f":"IF(AND(F45=0,D52=0),\"\",IF(AND(F45=0,D52=0),\"\",IF($AX$41=\"H\",$AT$44,IF($AX$41=\"v\",4*$AT$44,IF($D$45=\"\",\"\",IF($D$45=0,$C$45,IF($D$52=\"\",\"\",($D$52*-$C$45+$F$45)/$D$45)))))))","v":""},null,null,null,null,null,{"$f":"IFERROR(BB39,\"\")","v":0},0,0,0]
[null,null,null,null,null,null,null,null,null,null,null,null,null,null,null,null,null,null,null,null,null,null,null,null,null,null,null,null,null,null,null,null,null,null,null,{"$f":"IF(BJ15=\"\",\"\",\"x\")","v":""},{"$f":"IF(BJ15=\"\",\"\",\"y\")","v":""}]
[null,null,null,null,null,null,null,null,null,null,null,null,null,null,null,null,null,null,null,null,null,null,null,null,null,null,null,null,null,null,null,null,null,null,null,{"$f":"IF(AJ43=\"\",0,IF(BD28=\"\",\"\",BD28))","v":0},{"$f":"IF(AK43=\"\",0,IF(BD29=\"\",\"\",BD29))","v":0},null,null,null,null,null,null,null,null,{"$f":"IF(AX41=\"V\",F45/C45,IF(AX41=\"H\",F45/D45,\"R\"))","v":"R"}]

{"sheet":"Graph Paper 10px","index":1,"n_rows":95,"n_cols":57,"rows_kept":95,"cut":false,"hidden":false,"merged":[]}
[null,null,null,"Name:",null,null,null,null,null,null,null,null,null,null,null,null,null,null,null,null,null,null,null,null,null,null,null,null,null,null,null,null,null,null,null,null,null,null,null,null,null,null,null,null,null,null,null,null,null,null,null,null,null,null,null,null,"Date:"]
[]
[]
[]
[]
[]
[]
[]
[]
[]
[]
[]
[]
[]
[]
[]
[]
[]
[]
[]
[]
[]
[]
[]
[]
[]
[]
[]
[]
[]
[]
[]
[]
[]
[]
[]
[]
[]
[]
[]
[]
[]
[]
[]
[]
[]
[]
[]
[]
[]
[]
[]
[]
[]
[]
[]
[]
[]
[]
[]
[]
[]
[]
[]
[]
[]
[]
[]
[]
[]
[]
[]
[]
[]
[]
[]
[]
[]
[]
[]
[]
[]
[]
[]
[]
[]
[]
[]
[]
[]
[]
[]
[]
[]
[null,null,null,"Grid is not perfectly square"]

{"sheet":"Graph Paper 15px","index":2,"n_rows":63,"n_cols":37,"rows_kept":63,"cut":false,"hidden":false,"merged":[]}
[null,null,null,"Name:",null,null,null,null,null,null,null,null,null,null,null,null,null,null,null,null,null,null,null,null,null,null,null,null,null,null,null,null,null,null,null,null,"Date:"]
[]
[]
[]
[]
[]
[]
[]
[]
[]
[]
[]
[]
[]
[]
[]
[]
[]
[]
[]
[]
[]
[]
[]
[]
[]
[]
[]
[]
[]
[]
[]
[]
[]
[]
[]
[]
[]
[]
[]
[]
[]
[]
[]
[]
[]
[]
[]
[]
[]
[]
[]
[]
[]
[]
[]
[]
[]
[]
[]
[]
[]
[null,null,null,"Grid is not perfectly square"]

{"sheet":"Graph Paper 20px","index":3,"n_rows":48,"n_cols":28,"rows_kept":48,"cut":false,"hidden":false,"merged":[]}
[null,null,null,"Name:",null,null,null,null,null,null,null,null,null,null,null,null,null,null,null,null,null,null,null,null,null,null,null,"Date:"]
[]
[]
[]
[]
[]
[]
[]
[]
[]
[]
[]
[]
[]
[]
[]
[]
[]
[]
[]
[]
[]
[]
[]
[]
[]
[]
[]
[]
[]
[]
[]
[]
[]
[]
[]
[]
[]
[]
[]
[]
[]
[]
[]
[]
[]
[]
[null,null,null,"Grid is not perfectly square"]